program: Gaussian 16
title: QHBcyclo-TS1
version: ES64L-G16RevC.01
method: RwB97XD
basis: GenECP
operation: Freq
keyword: #N
keyword: Geom=AllCheck
keyword: Guess=TCheck
keyword: SCRF=Check
keyword: GenChk
keyword: RwB97XD/GenECP
keyword: Freq
converged: YES YES YES YES
title: Mulliken charges:
elementType: C C H C N N N H H H H H B C C C C C H H H H H H H H H H
charge: -0.387835 -0.667715 0.264314 -0.027753 0.365638 -0.460437 0.175960 0.299310 -0.088833 0.211105 0.213066 0.205646 -0.022709 -0.245948 -0.245999 -0.443030 -0.442553 -0.297151 0.173940 0.147875 0.173983 0.147737 0.169400 0.126964 0.154775 0.172849 0.154577 0.172824
chargesum: -0.00000
title: Mulliken charges with hydrogens summed into heavy atoms:
elementType: C C C N N N B C C C C C
charge: 0.241982 -0.403401 -0.027753 0.365638 -0.460437 0.475270 -0.111542 0.081453 0.081625 -0.121215 -0.120832 -0.000787
chargesum: 0.00000
1716.lowfreq: -1374.1460 -6.8664 -0.0006 0.0001 0.0003 4.8907 12.9128 46.2509 55.8848
frequency: -1374.1460 45.9079 55.8633 78.7445 88.8381 206.5006 214.0535 219.9902 250.8691 337.1538 360.0300 386.2599 420.2761 486.2342 501.3192 662.1737 678.5461 687.2003 732.2846 736.0317 761.3265 830.3759 832.5698 854.2500 883.9365 904.2114 917.8334 993.4206 1028.1916 1046.0041 1059.8185 1073.3349 1085.5637 1086.0256 1087.6181 1123.6659 1153.2112 1156.4881 1162.3015 1180.7293 1210.7885 1238.9394 1272.7726 1288.1702 1323.3481 1324.0302 1327.5654 1346.5590 1366.3592 1383.3273 1383.9032 1400.6708 1450.7911 1456.2292 1460.2922 1475.5112 1486.7879 1489.1305 1491.0918 1503.7353 1514.7749 1591.5742 1732.8204 1877.0899 2987.8188 2991.5363 3009.8902 3010.5169 3011.4482 3049.0914 3050.6115 3053.2236 3057.8376 3066.7462 3081.1916 3166.0797 3195.0527 3296.9848
redmass: 1.0950 1.0507 3.7273 2.9677 4.0597 3.0053 2.9304 1.8569 3.7829 1.9864 5.2745 2.0380 3.1133 1.6840 3.5393 2.7189 3.1074 1.5368 4.7448 3.1011 1.3674 1.4105 2.9844 1.6396 2.6671 1.3663 2.3256 3.4428 1.5689 1.6919 1.2615 2.2058 2.2017 5.1972 1.7436 1.8372 1.3289 1.4081 1.4942 1.6482 1.0307 1.4070 1.5493 1.2442 4.5534 1.5882 1.7972 2.4399 1.3489 1.5223 1.5114 4.4209 1.5586 1.0948 1.0884 2.2301 1.0373 1.0840 1.0931 1.0978 1.2626 4.9642 1.1102 1.0684 1.0669 1.0665 1.0632 1.0680 1.0609 1.0917 1.0931 1.1027 1.0965 1.1001 1.0329 1.1069 1.1053 1.1010
irintensity: 4687.6590 0.0061 1.4253 1.5873 4.9030 0.8073 1.3113 0.0577 0.2400 3.0655 0.0076 4.9974 0.0163 2.2914 3.3804 6.4272 7.0150 0.0610 1.6995 38.9562 4.6631 30.9730 11.3294 21.1391 27.3966 1.1398 7.0868 81.4954 6.6451 6.6176 7.9690 25.8493 22.9862 12.2005 8.1626 11.4966 0.9949 2.5032 30.5293 132.9109 21.9968 4.7603 51.2958 0.0146 43.1914 14.0507 22.1458 38.2877 0.1328 1.4827 0.3489 8.4666 11.1747 7.6165 3.4449 20.5915 17.1588 8.8803 4.6510 3.2728 4.5897 8.0216 554.3201 119.2219 15.7549 70.7539 29.6394 44.3396 48.1005 156.9475 45.1355 21.6526 140.3952 110.4434 24.3046 5.9930 0.8148 1.6008
temp: 298.150 k
press: 1.00000 atm
elementType: 6 6 1 6 7 7 7 1 1 1 1 1 5 6 6 6 6 6 1 1 1 1 1 1 1 1 1 1
symmnumber: 1
zpe: 626804.0 jmol-1
zpe.correction: 0.238737 hartree
zpe.thermalcorrener: 0.250211 hartree
zpe.thermalcorrenthalpy: 0.251155 hartree
zpe.thermalcorrgfe: 0.200428 hartree
zpe.sumelectzpe: -503.251098 hartree
zpe.sumelectthermal: -503.239624 hartree
zpe.sumelectthermalent: -503.238680 hartree
zpe.sumelectthermalfe: -503.289407 hartree
dipole: 6.5306 -0.7283 -0.8661
dipole: 6.6280
quadrupole: -89.6238 -77.0583 -79.5993
quadrupole: -10.5751 3.4242 1.2457
quadrupole: -7.5300 5.0355 2.4945 -10.5751 3.4242 1.2457
hfenergy: -503.4898349 hartree
pointgroup: C01 [X(C8H16B1N3)]
dipole: 2.5693481 -0.2865518 -0.3407589 debye
polarizability: 184.4241816|15.9083161|141.2870261|-11.3677424|-4.8527349|121.5823429 unknown
InChI: InChI=1/C8H16BN3/c1-12-7-8(10-11-12)9-5-3-2-4-6-9/h7,9-10H,2-6H2,1H3
charge 0 multiplicity 1
28 atoms
C  1.69772453 -0.52357556 -0.09187637
C  -0.51466263 -1.65990763 0.36657199
H  -0.09057801 -2.6482068 0.42047498
C  -1.7976393 -1.18496825 0.49601241
N  0.26103377 -0.56732093 0.12755573
N  -0.44882453 0.54479801 0.0996421
N  -1.67181977 0.15580126 0.32128912
H  -2.94454271 0.34622475 0.48258364
H  -3.79568485 -0.17555204 0.66566458
H  1.94882408 -1.07881291 -0.99534996
H  1.98276408 0.51923408 -0.2080691
H  2.21189158 -0.95432969 0.76670695
B  -3.34825886 -1.52426197 0.76014817
C  -4.14555077 -2.29428758 -0.40337242
C  -3.76306317 -1.98069668 2.24410474
C  -5.6477865 -2.38423586 -0.10130053
C  -5.28609622 -2.08695557 2.40230207
C  -5.92249599 -2.93889443 1.29983819
H  -6.16235109 -2.99968276 -0.84854685
H  -6.08943812 -1.38063595 -0.17186563
H  -5.55129262 -2.49677884 3.38394578
H  -5.7231384 -1.07971222 2.36073031
H  -7.00324315 -3.01240162 1.46467294
H  -5.52642466 -3.96197504 1.36414216
H  -3.3440856 -1.3251878 3.01734303
H  -3.3205061 -2.97411787 2.42061061
H  -3.98131859 -1.84744679 -1.39153591
H  -3.73677253 -3.3156251 -0.46407673
