program: Gaussian 16
title: MeQHBCCH TS1
version: ES64L-G16RevC.01
method: RwB97XD
basis: GenECP
operation: Freq
keyword: #N
keyword: Geom=AllCheck
keyword: Guess=TCheck
keyword: SCRF=Check
keyword: GenChk
keyword: RwB97XD/GenECP
keyword: Freq
converged: YES YES YES YES
title: Mulliken charges:
elementType: C C H C N N N B H H H H H C C H C C H
charge: -0.388063 -0.154304 0.273501 -0.285948 0.304614 -0.370445 0.013832 -0.122691 0.343964 -0.009028 0.211124 0.214539 0.210554 -0.081516 -0.321487 0.282257 -0.079370 -0.323775 0.282242
chargesum: 0.00000
title: Mulliken charges with hydrogens summed into heavy atoms:
elementType: C C C N N N B C C C C
charge: 0.248154 0.119197 -0.285948 0.304614 -0.370445 0.357796 -0.131719 -0.081516 -0.039230 -0.079370 -0.041533
1716.lowfreq: -1154.1404 -9.8370 -0.0003 -0.0002 0.0005 3.9729 7.0910 56.3069 66.0773
frequency: -1154.1404 56.2644 65.8147 82.5008 102.4241 123.1069 184.2239 283.5806 299.0914 308.7836 394.5660 435.2379 446.4909 502.3381 666.2735 681.2770 703.8220 706.2140 707.5676 735.8948 736.2108 738.5181 745.8942 839.4738 931.6476 1057.2731 1066.7860 1076.1144 1086.8713 1123.8076 1132.4841 1156.5119 1180.6169 1323.9304 1340.4085 1394.2248 1453.5299 1483.2606 1488.1392 1515.4519 1608.2111 1744.0484 1997.4925 2184.6626 2187.2400 3081.4338 3167.2509 3195.9413 3301.1973 3465.3039 3465.8839
redmass: 1.1273 4.4920 1.0871 4.6577 4.2093 3.7996 3.4734 3.8818 5.1952 3.7953 5.2960 6.5217 4.1287 6.5999 3.3494 5.0474 1.2821 1.3526 1.3252 2.7892 1.3741 1.6900 3.9729 1.4599 6.9909 7.4045 1.8311 1.8258 4.2155 2.1579 1.0418 1.3055 1.6515 6.2066 4.8805 4.7224 1.4304 2.1935 1.0369 1.3573 5.3287 1.0725 1.0587 5.7553 5.8547 1.0329 1.1072 1.1053 1.1019 1.1630 1.1632
irintensity: 4164.5948 1.4539 0.1248 6.2445 0.0706 5.0382 0.2018 1.6007 2.7643 4.6744 15.7650 1.7441 7.3303 11.4106 8.4863 41.7897 10.5701 31.7573 78.9880 2.5661 78.0125 2.8131 105.0999 31.0199 218.0775 196.8382 11.8128 6.1366 18.2496 142.2091 14.2073 0.5210 115.1690 26.5776 32.8373 0.9605 7.8857 19.8438 17.3119 5.8256 2.0155 159.9951 1178.7285 0.7176 18.3890 22.0067 5.2289 0.5382 3.3956 77.9139 44.1543
temp: 298.150 k
press: 1.00000 atm
elementType: 6 6 1 6 7 7 7 5 1 1 1 1 1 6 6 1 6 6 1
symmnumber: 1
zpe: 357416.0 jmol-1
zpe.correction: 0.136133 hartree
zpe.thermalcorrener: 0.147051 hartree
zpe.thermalcorrenthalpy: 0.147995 hartree
zpe.thermalcorrgfe: 0.098604 hartree
zpe.sumelectzpe: -460.279471 hartree
zpe.sumelectthermal: -460.268553 hartree
zpe.sumelectthermalent: -460.267608 hartree
zpe.sumelectthermalfe: -460.317000 hartree
dipole: 6.3463 1.0387 -0.5621
dipole: 6.4553
quadrupole: -72.7720 -70.7938 -62.7564
quadrupole: -9.9581 3.9395 4.0819
quadrupole: -3.9979 -2.0198 6.0177 -9.9581 3.9395 4.0819
hfenergy: -460.4156037 hartree
pointgroup: C01 [X(C7H8B1N3)]
dipole: 2.4968355 0.4086489 -0.2211334 debye
dipolederiv: 0.6157763 0.1235486 -0.0584465 0.1499795 0.1910925 0.0072051 -0.0703196 0.0068049 0.2180054 0.1575606 -0.1965062 0.073772 0.157598 -0.0372523 -0.0098625 -0.0680192 -0.0025049 -0.0543003 0.0741973 0.0243404 -0.0067106 0.0235691 0.1151271 0.0308384 -0.0070441 0.0318143 0.1831248 -0.2006422 0.1784846 -0.0715315 -0.0898113 -0.4030905 0.0765683 0.0349242 0.0703055 -0.2418206 -0.7523387 -0.273137 0.1237682 -0.0764101 0.2167952 -0.1115675 0.0452613 -0.1060787 -0.0250144 0.1885887 -0.2182828 0.0811369 -0.1002963 -0.4045798 0.1371364 0.0345035 0.1402022 -0.1250636 -1.1554791 -0.4100116 0.186704 -0.4283276 -0.1860925 0.0165293 0.1939003 0.0163668 -0.1811265 0.7094579 -0.0391922 0.034247 0.348487 1.4022258 -0.0074539 -0.1216319 0.0013902 1.4051788 1.3506102 1.0599097 -0.4541927 0.7744634 0.7743356 -0.2979699 -0.3383871 -0.3045477 0.2048983 -0.2363558 -0.0692644 0.0313284 -0.4183856 -0.8171404 0.3051736 0.1701142 0.2965796 -0.2034091 -0.040735 -0.0433289 0.0268074 0.0352946 0.0177745 -0.0844737 0.0707461 -0.0597778 0.0383088 0.0512168 0.0479852 -0.0173771 -0.0431247 0.0071017 0.0457555 0.0186222 0.0435341 0.1024488 -0.0421715 -0.0472222 0.0115953 -0.0187049 0.1012679 0.0284031 -0.0730661 0.0060785 -0.0389431 -0.3118487 -0.0492988 -0.026505 -0.1138511 -0.4076985 -0.0121307 0.0163825 -0.0492818 -0.3850898 -0.3086389 -0.0595423 -0.0317242 -0.1042299 -0.4285768 -0.1233946 -0.0747156 -0.1383652 -0.3947307 0.2549499 -0.0019714 -0.014965 0.0071181 0.2392329 -0.0215183 -0.012019 -0.015336 0.2511616 -0.308033 -0.0166304 0.0467969 -0.0959579 -0.3632807 -0.0022274 0.0615671 0.0303496 -0.4305587 -0.3020908 -0.0189689 0.0540002 -0.0213106 -0.2801616 0.0137787 0.1165213 0.0293387 -0.5491418 0.255976 0.0090887 0.0112962 0.0139002 0.26292 0.0092102 0.0026599 0.0031278 0.226072 unknown
polarizability: 135.6473688|25.1177578|129.5541777|-10.2467577|-2.3817877|126.1037638 unknown
InChI: InChI=1/C7H7BN3.H/c1-4-8(5-2)7-6-11(3)10-9-7;/h1-2,6,8H,3H3;
charge 0 multiplicity 1
19 atoms
C  1.58582395 -0.08715247 -0.05148072
C  -0.28686876 -1.64886498 0.61312973
H  0.36506479 -2.44958515 0.91770148
C  -1.65099249 -1.51409377 0.59032244
N  0.19591624 -0.4733478 0.13364068
N  -0.77568407 0.3676377 -0.17977026
N  -1.87357111 -0.26898165 0.09876775
B  -3.05707548 -2.21392434 0.90402589
H  -3.23317899 -0.48428389 0.21658865
H  -3.87710815 -1.12469457 0.48715553
H  2.06455409 -0.767122 -0.75535299
H  1.59581403 0.92442268 -0.44986368
H  2.10388983 -0.112899 0.90668628
C  -3.49369372 -3.36557856 -0.05120016
C  -3.81698964 -4.25645968 -0.7974003
H  -4.10732072 -5.04618582 -1.45072215
C  -3.43385496 -2.37892602 2.407475
C  -3.71076326 -2.50088907 3.57515201
H  -3.96013853 -2.614855 4.60452777
