program: Gaussian 16
title: f_benzopiperidine
version: ES64L-G16RevC.02
method: RwB97XD
basis: GenECP
operation: Freq
keyword: #N
keyword: Geom=AllCheck
keyword: Guess=TCheck
keyword: SCRF=Check
keyword: GenChk
keyword: RwB97XD/GenECP
keyword: Freq
converged: YES YES YES YES
title: Mulliken charges:
elementType: H C C C C H C H H B H H C N C C C H H C H H C H H H H H H F F
charge: 0.212820 -0.411147 -0.091451 -0.303671 -0.546090 0.245037 -0.146418 0.238947 0.189669 0.288155 0.072452 0.147209 0.092560 0.079821 -0.151419 -0.358783 -0.477231 0.226371 0.167413 -0.415385 0.220899 0.205376 -0.437570 0.210186 0.175619 0.212681 0.179106 0.214186 0.145303 -0.061232 -0.123413
chargesum: -0.00000
title: Mulliken charges with hydrogens summed into heavy atoms:
elementType: C C C C C B C N C C C C C F F
charge: -0.198327 0.153586 -0.064723 -0.546090 0.043251 0.360607 0.092560 0.227030 0.242365 0.067492 -0.091426 -0.023598 -0.078082 -0.061232 -0.123413
chargesum: 0.00000
1716.lowfreq: -566.8181 -36.3688 -0.0008 -0.0005 0.0007 7.2668 10.7834 20.6491 78.9533
frequency: -566.7814 -31.2194 78.7269 82.2565 89.0864 115.5814 202.9318 226.4144 238.5249 269.1114 304.9402 333.1388 358.9385 388.2124 465.1133 489.3880 506.5754 511.6308 542.8802 570.2656 639.9445 668.5513 715.1691 747.9437 782.2984 792.6922 803.8347 828.0410 857.7476 884.6596 903.4534 935.1507 938.7471 982.0193 986.2978 990.5551 1025.1341 1045.2236 1064.5365 1075.4324 1088.7493 1113.3433 1127.4946 1146.2851 1152.7298 1167.0052 1176.7042 1189.0449 1208.8585 1237.4220 1256.5707 1273.9472 1297.7327 1308.4210 1314.5773 1325.3665 1358.8064 1361.6163 1394.6555 1397.1194 1398.7469 1427.8680 1484.9500 1488.4159 1489.8472 1498.3837 1499.9360 1514.9084 1525.0579 1606.2182 1641.9920 1675.7322 2829.4364 2991.4811 3001.3674 3034.0216 3046.8632 3048.6172 3098.3459 3102.9920 3106.6318 3109.6888 3117.6001 3182.3787 3190.8830 3201.7691 3213.0075
redmass: 1.2846 5.0461 3.8888 3.7148 4.2711 5.6452 4.8718 3.1264 2.4029 3.1825 5.5622 3.1625 3.7850 2.1758 3.0079 3.5354 1.8943 3.1796 7.6331 3.4014 4.4505 4.0216 1.8488 2.0143 1.4678 2.9951 3.2200 1.4587 3.2550 1.3827 1.4468 2.2439 2.6707 1.9836 1.7978 1.4104 1.3246 2.7731 1.9454 2.0247 1.4340 1.6277 3.8963 1.7197 2.0294 1.3043 2.0892 1.1515 1.2902 2.8086 2.4178 2.0579 1.2464 1.4607 1.5013 3.0745 1.4596 1.3388 1.4862 1.4469 1.4217 1.5193 1.0951 2.2754 1.0968 1.1070 1.0830 1.1070 2.5994 1.0622 6.0665 6.0404 1.0204 1.0712 1.0691 1.0681 1.0637 1.0635 1.0953 1.1000 1.1017 1.0956 1.0940 1.0868 1.0892 1.0938 1.0988
irintensity: 1541.1612 0.5685 0.1477 4.0642 0.3697 1.5940 18.2901 20.3524 0.9855 0.4013 6.5698 10.1548 4.2833 0.2357 0.5285 4.0250 4.8000 9.8078 5.0969 9.8330 17.0375 57.3056 27.3510 45.8378 51.6610 10.6639 25.7197 0.3906 0.3009 9.3916 1.3719 13.7467 49.8272 55.8028 61.7024 5.9775 0.1587 22.1531 9.4480 5.7349 4.4153 12.9842 225.6119 50.7864 114.2218 0.9735 4.5894 1.4577 4.4473 199.9573 38.7958 15.8507 0.3922 27.2516 16.8647 24.4760 20.2309 6.5304 1.1918 4.1638 2.7726 8.5965 4.6865 36.5164 13.3885 29.9410 3.2864 14.6771 29.2589 142.5921 20.3160 37.9582 1731.7435 19.1656 15.9934 29.9096 24.4564 37.1179 58.0248 44.4684 35.9583 29.8102 16.1493 3.6157 4.1905 25.6262 18.6425
temp: 298.150 k
press: 1.00000 atm
elementType: 1 6 6 6 6 1 6 1 1 5 1 1 6 7 6 6 6 1 1 6 1 1 6 1 1 1 1 1 1 9 9
symmnumber: 1
zpe: 675081.1 jmol-1
zpe.correction: 0.257125 hartree
zpe.thermalcorrener: 0.269400 hartree
zpe.thermalcorrenthalpy: 0.270344 hartree
zpe.thermalcorrgfe: 0.218552 hartree
zpe.sumelectzpe: -707.897543 hartree
zpe.sumelectthermal: -707.885268 hartree
zpe.sumelectthermalent: -707.884324 hartree
zpe.sumelectthermalfe: -707.936116 hartree
dipole: 2.0369 -5.7356 1.6796
dipole: 6.3140
quadrupole: -58.5134 -103.6252 -92.8068
quadrupole: -27.6189 9.0247 1.4828
quadrupole: 26.4684 -18.6434 -7.8250 -27.6189 9.0247 1.4828
hfenergy: -708.1546683 hartree
pointgroup: C01 [X(C11H16B1F2N1)]
dipole: 0.8013609 -2.2565491 0.6608011 debye
polarizability: 198.6788508|-9.0149683|176.5612656|-4.543352|-10.6411095|127.681089 unknown
InChI: InChI=1/C11H15BF2N.H/c13-12(14)10-6-2-3-7-11(10)15-8-4-1-5-9-15;/h2-3,6-7,12H,1,4-5,8-9H2;
charge 0 multiplicity 1
31 atoms
H  0.36249964 0.64142844 0.42970356
C  1.43386357 0.47740966 0.39941484
C  2.29096956 1.53014733 0.10484763
C  1.95202455 -0.78630588 0.66296517
C  3.67561232 1.34809209 0.05547545
H  1.87870547 2.51637972 -0.0832484
C  3.32463669 -0.9937149 0.62816761
H  1.28768164 -1.61124612 0.89483845
H  3.72942098 -1.97873999 0.83278815
B  4.64922069 2.57249855 -0.2699881
H  5.91963807 2.32855621 0.35353813
H  5.84361499 1.48454493 0.26358829
C  4.1744405 0.06537825 0.32270004
N  5.61070425 -0.10472169 0.27037268
C  6.20630605 -0.75879571 1.44253049
C  6.07650395 -0.68207288 -1.00298522
C  7.72539718 -0.64152849 1.3932158
H  5.80323593 -0.27668578 2.33567641
H  5.91996304 -1.82064432 1.47681678
C  7.59208621 -0.57567374 -1.11172943
H  5.58768457 -0.13789329 -1.81309443
H  5.76002536 -1.73488841 -1.06641318
C  8.27541022 -1.22391797 0.09164131
H  8.15028914 -1.15480739 2.25976891
H  8.00547224 0.41495022 1.47344176
H  7.91578849 -1.04559452 -2.04398944
H  7.87014129 0.4826698 -1.17080891
H  9.35783747 -1.08267339 0.03812152
H  8.09300482 -2.30574205 0.07363104
F  4.38338829 3.76216822 0.3677759
F  5.0325192 2.73602022 -1.587379
