program: Gaussian 16
title: MeQCNBF2 TS1
version: ES64L-G16RevC.01
method: RwB97XD
basis: GenECP
operation: Freq
keyword: #N
keyword: Geom=AllCheck
keyword: Guess=TCheck
keyword: SCRF=Check
keyword: GenChk
keyword: RwB97XD/GenECP
keyword: Freq
converged: YES YES YES YES
title: Mulliken charges:
elementType: C C C N N N B H H H H H F F C N
charge: -0.404146 0.818013 -0.673269 0.218164 -0.207912 0.104155 0.259968 0.324418 -0.050869 0.233867 0.227858 0.233839 -0.091926 -0.092003 -0.688075 -0.212081
chargesum: -0.00000
title: Mulliken charges with hydrogens summed into heavy atoms:
elementType: C C C N N N B F F C N
charge: 0.291418 0.818013 -0.673269 0.218164 -0.207912 0.428573 0.209099 -0.091926 -0.092003 -0.688075 -0.212081
1716.lowfreq: -1327.8933 -15.3112 -0.0008 -0.0006 0.0009 4.4342 12.9191 64.3268 82.1066
frequency: -1327.8931 63.7574 81.6599 93.1315 111.3367 174.4477 217.2009 234.8679 315.9211 393.8079 395.2676 513.8276 534.6480 605.7990 623.1030 694.0106 698.2330 719.2711 796.3299 847.4478 1016.5572 1091.5442 1110.7610 1157.4770 1187.5197 1192.8599 1239.9104 1278.3919 1341.8631 1361.9836 1399.4627 1451.4791 1485.7375 1486.6680 1506.7837 1623.5365 1769.6267 1887.0447 2399.9882 3086.5889 3176.1298 3206.0796
redmass: 1.1562 3.3129 1.7314 3.3580 11.0807 6.8835 4.8083 5.2696 9.9498 8.0282 5.2026 9.6511 10.0082 8.2424 11.2572 10.2221 4.8246 2.6944 1.7431 5.0371 4.9621 1.8978 3.9414 1.3307 9.4655 1.9733 1.0386 7.5162 6.3735 3.5096 5.2013 1.7310 2.0791 1.0790 1.2387 7.0061 1.1031 1.0689 12.6501 1.0324 1.1076 1.1063
irintensity: 3522.4982 0.7455 0.2434 0.0780 6.3279 11.1805 3.4271 0.1269 16.8980 0.1925 3.4528 3.2888 3.2979 13.3925 0.9592 0.5406 86.2303 1.8845 6.8408 300.9180 311.1832 31.0665 62.1701 0.0053 335.9342 5.1483 57.5282 77.2596 34.6657 139.6967 2.5955 4.5308 12.9249 20.2513 11.7526 2.8361 681.3490 137.5181 33.3330 5.2163 0.9648 0.0536
temp: 298.150 k
press: 1.00000 atm
elementType: 6 6 6 7 7 7 5 1 1 1 1 1 9 9 6 7
symmnumber: 1
zpe: 266600.1 jmol-1
zpe.correction: 0.101543 hartree
zpe.thermalcorrener: 0.111502 hartree
zpe.thermalcorrenthalpy: 0.112446 hartree
zpe.thermalcorrgfe: 0.064983 hartree
zpe.sumelectzpe: -598.853733 hartree
zpe.sumelectthermal: -598.843774 hartree
zpe.sumelectthermalent: -598.842830 hartree
zpe.sumelectthermalfe: -598.890293 hartree
dipole: 4.9237 5.4558 -2.7368
dipole: 7.8421
quadrupole: -73.9491 -86.8161 -70.0128
quadrupole: -8.1721 3.2144 10.4990
quadrupole: 2.9769 -9.8901 6.9132 -8.1721 3.2144 10.4990
hfenergy: -598.9552761 hartree
pointgroup: C01 [X(C4H5B1F2N4)]
dipole: 1.937114 2.146478 -1.0767468 debye
dipolederiv: 0.4903333 0.1445294 -0.0659415 0.1285753 0.1852502 0.0043469 -0.0564934 0.0044288 0.1787055 0.1891044 -0.0558176 0.0321493 0.2183312 0.0625951 0.046318 -0.1154335 0.0351893 0.1095475 -0.359216 0.0439199 -0.0351968 -0.0609181 -0.2799679 0.1080485 0.0225702 0.1119136 -0.1324759 -0.6686494 -0.217842 0.0907157 -0.1537864 0.3783974 -0.2195238 0.0566882 -0.2206441 0.1005907 0.1452887 0.1001511 -0.0454104 0.1349881 -0.4069845 0.1857468 -0.064454 0.1824221 -0.1714533 -1.1503498 -0.3782101 0.1642678 -0.4473678 -0.2421333 0.0354422 0.2032041 0.0395477 -0.1555281 1.5284911 0.0729191 -0.047666 0.576044 1.9451756 -0.0775867 -0.3198995 -0.098233 1.8008194 1.4742447 0.7069653 -0.328482 0.7332746 0.5109604 -0.1675749 -0.3440689 -0.1683701 0.223075 -0.3870796 0.0077345 -0.0161948 -0.3176854 -0.5879992 0.2600504 0.1585882 0.2722802 -0.2217669 -0.0025063 -0.0463589 0.019245 0.0173338 0.015657 -0.0692109 0.0371234 -0.0514314 0.0808319 0.0613771 0.0459793 -0.0280023 -0.0259681 0.0425661 0.0463713 0.0113839 0.0487912 0.1043384 0.0019248 -0.043232 0.0316571 -0.0265885 0.1146194 0.0155035 -0.0325843 -0.0053549 -0.0196501 -0.5928312 -0.1933902 -0.0764844 -0.4598441 -1.1463106 -0.2369734 -0.0963423 -0.3117255 -0.5865559 -0.6256311 -0.05792 0.2354264 -0.1826506 -0.5108405 0.1091685 0.4665087 0.1998899 -1.1898803 0.2670792 -0.1807576 0.0997495 -0.201195 0.282433 -0.0699988 0.1120986 -0.0680039 0.2093578 -0.3715801 0.0513296 -0.0298326 0.067457 -0.3634181 0.0298725 -0.0388896 0.0293003 -0.3299557 unknown
polarizability: 121.4646583|-5.1808527|100.9683755|5.1747764|-22.2485647|72.0548078 unknown
InChI: InChI=1/C4H5BF2N4/c1-11-3(2-8)4(5(6)7)9-10-11/h5,9H,1H3
charge 0 multiplicity 1
16 atoms
C  1.61646233 -0.08801936 -0.05751752
C  -0.2493594 -1.63559729 0.69921675
C  -1.61976747 -1.55958651 0.60471213
N  0.22689692 -0.49743518 0.10675532
N  -0.75476141 0.25297541 -0.33496181
N  -1.84281141 -0.39306481 -0.03050949
B  -3.05824445 -2.23627291 0.91313348
H  -3.14329675 -0.5259574 -0.00887619
H  -3.83339001 -1.17595884 0.31378843
H  2.14398364 -0.83407672 -0.65040943
H  1.61282922 0.86908379 -0.5720434
H  2.08142086 0.01143269 0.92256226
F  -3.36768057 -3.35816188 0.19691908
F  -3.44514935 -2.26927172 2.22335052
C  0.61461732 -2.61021792 1.25592626
N  1.33534337 -3.3883448 1.70149798
