program: Gaussian 16
title: f_dibenzofuran
version: ES64L-G16RevC.02
method: RwB97XD
basis: GenECP
operation: Freq
keyword: #N
keyword: Geom=AllCheck
keyword: Guess=TCheck
keyword: SCRF=Check
keyword: GenChk
keyword: RwB97XD/GenECPFreq
converged: YES YES NO YES
title: Mulliken charges:
elementType: C C O C C C C C H C H H C H C H C C H B N C H H H C H H H H H F F
charge: -0.681893 1.154412 0.015217 0.581830 -0.826059 -0.098110 -0.000349 -0.304377 0.228122 -0.427592 0.243772 0.202492 -0.482283 0.214966 -0.294723 0.223828 -0.051212 -0.610598 0.243366 0.390529 0.041907 -0.387997 0.203442 0.220446 0.256719 -0.428077 0.197278 0.199933 0.228891 0.216047 -0.159849 -0.156681 -0.153396
chargesum: -0.00000
title: Mulliken charges with hydrogens summed into heavy atoms:
elementType: C C O C C C C C C C C C C B N C C F F
charge: -0.681893 1.154412 0.015217 0.581830 -0.826059 0.130013 -0.000349 -0.060605 -0.225101 -0.267317 -0.070895 0.192154 -0.610598 0.230681 0.257954 0.292610 0.198024 -0.156681 -0.153396
1716.lowfreq: -1433.2666 -6.6254 0.0005 0.0008 0.0009 2.1442 15.3102 61.6051 82.7127
frequency: -1433.2665 61.5976 82.6520 107.9537 128.6526 134.5873 155.9848 173.2098 195.7929 213.4174 261.0253 281.4619 289.3718 291.5987 315.2737 343.8673 385.5312 414.7138 438.0006 459.3795 514.2572 532.0032 560.6739 573.9992 585.8027 600.3856 614.4380 650.4271 684.2308 723.7187 756.2810 764.3876 785.5253 807.9114 823.0386 864.2573 870.3876 897.8599 899.4608 914.2601 931.3700 979.3094 985.8078 996.3181 1002.6413 1057.8256 1067.5871 1073.1274 1087.1970 1116.2896 1132.4103 1160.8484 1189.2559 1193.9916 1202.7400 1218.7400 1232.5982 1256.4811 1274.8421 1297.5460 1303.7364 1326.1943 1343.6360 1370.6258 1442.2773 1447.3821 1461.2638 1475.5029 1483.6217 1490.9527 1495.5803 1507.6627 1514.3101 1522.2261 1528.6994 1535.4685 1600.3018 1640.5926 1653.5144 1665.6116 1696.8503 3059.9377 3061.8299 3147.6047 3151.8419 3171.7716 3186.0122 3187.0968 3199.4213 3200.9291 3211.6415 3214.8423 3223.9950
redmass: 1.1730 5.0779 4.2864 5.3479 4.8907 4.8183 4.9406 2.9562 1.9094 1.9167 4.7169 1.2628 4.3929 3.6084 3.3354 5.6006 5.7362 3.9834 3.9344 4.3034 7.2221 4.4764 5.1282 4.3285 5.6453 4.0950 4.9980 4.8580 6.1419 4.8864 3.5163 2.0796 1.5238 3.9192 2.7132 4.4036 1.3804 6.0518 4.4444 1.5250 1.4453 2.5931 1.5172 1.3225 1.3366 1.8355 2.3581 2.0862 1.9598 1.5341 3.3771 2.4325 1.3008 1.5696 1.5972 2.0727 3.5116 3.7720 1.8763 2.9141 1.8892 3.2559 4.2867 3.8065 2.1958 1.2354 1.2393 1.4301 1.6931 1.1083 1.1328 1.0599 1.1324 2.2130 2.0693 1.4061 1.1802 7.1702 5.7113 8.1170 8.8599 1.0348 1.0361 1.1033 1.1038 1.1062 1.1050 1.0870 1.0917 1.0877 1.0967 1.0929 1.0962
irintensity: 7648.9541 2.4871 1.1070 6.4737 2.1770 1.2985 5.5940 2.8173 0.8997 2.7171 3.8861 0.4624 3.1090 0.5485 0.7813 1.0011 1.0671 3.5207 4.0611 4.5831 9.4359 10.8073 1.1330 14.8316 6.8566 4.0203 1.3274 7.0976 1.0180 49.4615 17.4099 7.8335 91.9743 5.5809 31.9488 4.5215 17.5076 17.2587 19.3430 6.0844 5.1120 99.9215 29.3033 1.8286 2.3675 22.1362 78.6683 24.8534 87.5287 57.8894 213.2914 147.8826 15.1243 65.4198 34.7180 4.5619 71.4712 133.4261 48.9475 94.7584 7.4314 26.9659 33.0283 3.9721 56.6452 7.4127 71.8592 13.7197 55.2724 2.3054 50.2674 48.9659 8.5793 14.1515 12.8320 82.8984 544.8881 27.1020 39.9638 19.9345 32.2705 12.6552 39.8832 8.2658 8.4551 7.8605 3.8627 1.4333 13.8848 1.6658 22.7196 10.6810 6.8026
temp: 298.150 k
press: 1.00000 atm
elementType: 6 6 8 6 6 6 6 6 1 6 1 1 6 1 6 1 6 6 1 5 7 6 1 1 1 6 1 1 1 1 1 9 9
symmnumber: 1
zpe: 664748.3 jmol-1
zpe.correction: 0.253189 hartree
zpe.thermalcorrener: 0.268628 hartree
zpe.thermalcorrenthalpy: 0.269572 hartree
zpe.thermalcorrgfe: 0.211410 hartree
zpe.sumelectzpe: -896.154896 hartree
zpe.sumelectthermal: -896.139457 hartree
zpe.sumelectthermalent: -896.138513 hartree
zpe.sumelectthermalfe: -896.196675 hartree
dipole: 9.1639 2.2266 1.5259
dipole: 9.5531
quadrupole: -102.8856 -103.4085 -114.9051
quadrupole: -20.1211 3.9720 1.9151
quadrupole: 4.1808 3.6578 -7.8387 -20.1211 3.9720 1.9151
hfenergy: -896.4080849 hartree
pointgroup: C01 [X(C14H14B1F2N1O1)]
dipole: 3.6053401 0.8760006 0.60033 debye
polarizability: 294.4332424|-6.5467401|236.9193266|1.4115206|0.9279697|139.0849395 unknown
InChI: InChI=1/C14H13BF2NO.H/c1-18(2)12-8-4-6-10-9-5-3-7-11(15(16)17)13(9)19-14(10)12;/h3-8,18H,1-2H3;
charge 0 multiplicity 1
33 atoms
C  -1.12253125 0.53006296 -0.78516996
C  -0.76061596 1.87564422 -0.65370995
O  -0.0496755 -0.23911251 -1.13805789
C  0.71799306 1.85196456 -0.63392263
C  1.01511187 0.4957352 -0.77480736
C  1.74403754 2.66476907 -0.15264452
C  2.06477162 -0.14403503 -0.15369112
C  2.92963631 2.05995227 0.26990251
H  1.60505033 3.73102434 -0.02014601
C  3.0774746 0.66713322 0.345947
H  3.72659649 2.6835323 0.65723653
H  3.93856426 0.24839915 0.85203225
C  -1.75469377 2.74160452 -0.2029396
H  -1.56987703 3.80226729 -0.07756416
C  -2.97520667 2.18687818 0.1900832
H  -3.7528366 2.8461574 0.5593774
C  -3.17332602 0.80056816 0.25653698
C  -2.20665639 -0.09724819 -0.21378146
H  -4.0639531 0.42268944 0.74742728
B  -1.95978385 -1.64703101 0.1739124
N  1.79182765 -1.54479223 0.14788863
C  1.99296479 -2.44933785 -1.00671461
H  3.05478528 -2.50712183 -1.25816285
H  1.61911431 -3.43778877 -0.73882189
H  1.42468778 -2.07655401 -1.85575191
C  2.48159724 -2.03801426 1.35069338
H  2.08337058 -3.02481754 1.58723013
H  3.55888409 -2.11603569 1.18497696
H  2.28083412 -1.36245217 2.18138994
H  0.47340564 -1.61981205 0.42726319
H  -0.54332676 -1.68585858 0.67269579
F  -1.92091591 -2.56360217 -0.86017852
F  -2.67549774 -2.09614644 1.26514284
