program: Gaussian 16
title: Me_F-TS1
version: ES64L-G16RevC.01
method: RwB97XD
basis: GenECP
operation: Freq
keyword: #N
keyword: Geom=AllCheck
keyword: Guess=TCheck
keyword: SCRF=Check
keyword: GenChk
keyword: RwB97XD/GenECP
keyword: Freq
converged: YES YES YES YES
title: Mulliken charges:
elementType: H C C C C H C H C H B C H H H C H H H N H H F F
charge: 0.213993 -0.338156 0.106009 -0.310753 -0.631850 0.247602 -0.135847 0.234174 -0.068744 0.182521 0.232302 -0.425232 0.195087 0.188120 0.180546 -0.385087 0.159400 0.179485 0.211485 -0.053718 -0.004683 0.191492 -0.114266 -0.053882
chargesum: -0.00000
title: Mulliken charges with hydrogens summed into heavy atoms:
elementType: C C C C C C B C C N F F
charge: -0.124163 0.353612 -0.076579 -0.631850 0.046674 -0.068744 0.227619 0.138522 0.165283 0.137774 -0.114266 -0.053882
1716.lowfreq: -739.9871 -5.7399 -0.0009 0.0001 0.0004 4.4567 12.2631 76.4989 95.8920
frequency: -739.9869 76.4609 95.8837 117.3704 138.4877 186.9516 213.9690 248.5468 259.2347 285.0202 332.5562 364.2310 380.9887 487.8499 510.3831 540.2987 572.9051 581.6081 658.8006 711.8730 750.1411 780.8785 795.1556 809.6606 905.7361 916.0934 983.5930 988.1702 1025.2957 1062.6935 1073.0768 1075.1445 1114.1164 1136.2799 1164.7919 1180.8895 1192.2871 1211.7815 1220.4413 1257.0237 1294.7073 1312.9903 1330.4786 1341.7331 1449.9436 1475.4411 1486.3757 1490.2804 1496.8724 1505.0089 1521.9087 1525.5818 1532.3912 1645.1877 1677.9839 2587.4411 3024.7432 3030.6080 3110.9724 3113.0845 3152.9985 3165.2686 3184.5833 3193.5963 3205.1121 3215.0545
redmass: 1.3457 4.8000 4.6001 3.3904 4.2591 2.2772 2.0605 2.0780 1.0915 4.8480 4.1080 3.2660 3.6634 3.4007 3.3641 7.5048 4.0894 3.2385 4.3765 1.8460 1.9479 1.6038 3.1492 3.0825 1.4495 1.5661 3.0187 1.4061 1.3249 2.4898 1.9958 1.7542 1.2623 2.4749 3.7047 1.6337 1.1628 1.6056 1.8826 3.6844 1.3720 1.7586 4.8358 2.4798 1.1567 1.2232 1.0840 1.7374 1.0909 1.0931 1.0871 1.2391 1.8710 6.2114 6.2585 1.0253 1.0419 1.0423 1.0947 1.0959 1.1048 1.1029 1.0868 1.0896 1.0937 1.0985
irintensity: 1828.4876 0.2235 1.3476 0.5825 1.5951 11.4507 2.4609 12.5411 1.0577 1.5086 9.3873 0.4978 0.2047 4.7193 12.2593 15.9142 1.5599 14.9789 61.5760 46.1537 88.9734 40.4456 22.1177 49.8434 1.9640 86.7733 26.2488 3.5783 0.0973 81.3815 25.1959 34.1111 0.8185 169.0853 186.2737 35.2379 2.6118 26.5101 19.0180 181.0975 17.7521 74.2919 29.6365 12.1286 1.8933 8.8940 4.2370 17.4374 14.4935 23.9536 17.9426 27.9474 86.0236 16.9340 37.9962 1841.4246 32.2421 35.2001 29.0230 23.9386 15.7374 8.8844 2.1468 5.4923 24.9528 14.3713
temp: 298.150 k
press: 1.00000 atm
elementType: 1 6 6 6 6 1 6 1 6 1 5 6 1 1 1 6 1 1 1 7 1 1 9 9
symmnumber: 1
zpe: 499303.4 jmol-1
zpe.correction: 0.190175 hartree
zpe.thermalcorrener: 0.201571 hartree
zpe.thermalcorrenthalpy: 0.202516 hartree
zpe.thermalcorrgfe: 0.153138 hartree
zpe.sumelectzpe: -591.225428 hartree
zpe.sumelectthermal: -591.214031 hartree
zpe.sumelectthermalent: -591.213087 hartree
zpe.sumelectthermalfe: -591.262465 hartree
dipole: 1.2375 -5.8523 1.6454
dipole: 6.2038
quadrupole: -50.4475 -85.6278 -74.7541
quadrupole: -28.1813 9.2405 1.4253
quadrupole: 19.8290 -15.3513 -4.4777 -28.1813 9.2405 1.4253
hfenergy: -591.4156025 hartree
pointgroup: C01 [X(C8H12B1F2N1)]
dipole: 0.4868638 -2.3024563 0.6473414 debye
dipolederiv: -0.1188342 0.0178811 -0.0012539 0.0176247 0.0884165 0.0149138 -0.0010114 0.0181484 0.1519626 0.0607859 -0.0311871 0.0036113 -0.0035451 -0.1126577 -0.0098842 0.0046112 -0.016499 -0.1385718 0.0452694 -0.0422265 0.0030049 -0.1141097 0.1261531 -0.0579662 0.0159398 -0.0657022 -0.1110151 0.0479897 0.0411117 -0.014399 0.0347697 0.066627 -0.0503775 -0.0053147 -0.0520284 -0.1432219 -0.5107166 -0.132479 -0.0011145 0.0012015 -0.4577183 0.0747789 -0.0896347 0.0616091 -0.2209548 0.0491326 0.0572526 -0.0104277 0.0854124 -0.0505819 0.0432614 -0.0121703 0.0436688 0.1285692 -0.2202818 -0.0269378 0.0175197 -0.0915106 -0.0345458 -0.0338782 0.0828221 -0.0397489 -0.1220483 0.0069373 -0.085353 0.0227393 -0.0977557 -0.0275011 0.0434676 0.0148799 0.0501535 0.1420024 0.8658847 -0.0309871 -0.0210541 -0.1042437 0.1892155 -0.0036717 -0.0490882 0.0004154 -0.1182782 0.0665891 0.0868351 -0.0161583 0.0768013 -0.0347418 0.0453545 -0.015012 0.0463723 0.1398535 1.6883535 -0.1462952 -0.1621507 0.0605521 2.0249688 -0.1192656 -0.0843276 -0.3748564 1.640712 0.2204172 -0.0292325 -0.1617638 0.0267207 0.2721568 0.1420819 -0.3156114 0.2658565 0.363528 0.0767589 0.0444671 -0.0551297 0.0306525 0.0479159 0.069211 -0.0278537 0.0137912 -0.0056541 -0.1792502 0.0097674 0.0387743 -0.0218017 0.0810738 -0.0332206 -0.0114639 -0.0368748 0.0576098 0.0449792 -0.0782795 0.0074331 0.007711 -0.1788049 -0.1043645 0.059975 -0.0291375 0.0217156 0.1809682 -0.0812088 0.1472467 -0.1340534 0.3779085 -0.1337615 0.2378346 -0.234269 0.3163407 0.06409 -0.058047 -0.0282427 0.0158172 -0.1963451 0.0386143 -0.0512355 -0.0374566 0.0177078 -0.1671833 0.0129755 -0.0496626 -0.0379386 0.061852 0.0215242 0.0028926 0.0344634 0.0806363 0.0707052 0.0308284 0.0918879 0.0450088 0.0411402 -0.047291 0.0381471 -0.0059222 -0.063783 -0.6974638 0.0258402 0.0363385 0.1667861 -1.2795961 -0.0019831 0.1072404 -0.1079613 -0.4276549 -0.3566775 0.2396447 -0.1500595 0.1374943 -0.6775122 0.0743534 -0.156362 0.1094569 -0.1292714 -0.0516047 0.0305149 -0.0664662 -0.1039415 1.7204732 0.0184699 -0.07909 0.1881185 -0.0202282 -0.6304116 -0.1421083 0.3145761 -0.126889 -0.6275207 0.1646644 0.2468062 0.3441069 -1.0665971 -0.5564375 0.2872233 0.054751 0.1292368 -1.4203759 -0.155031 0.0870266 -0.1757044 -0.493359 unknown
polarizability: 155.1861504|-3.0168101|147.5148039|-1.2752944|-10.5611858|94.7119475 unknown
InChI: InChI=1/C8H10BF2N.2H/c1-12(2)8-6-4-3-5-7(8)9(10)11;;/h3-6H,1-2H3;;
charge 0 multiplicity 1
24 atoms
H  0.31375323 0.47469724 0.12456999
C  1.39068144 0.35020975 0.13716809
C  2.21991091 1.43452305 -0.12037411
C  1.94357574 -0.89418815 0.42163489
C  3.61019072 1.29830497 -0.11644461
H  1.78209729 2.40708767 -0.3202522
C  3.32305092 -1.05412081 0.44381284
H  1.30053664 -1.74245225 0.62760943
C  4.14201647 0.03584043 0.167304
H  3.75177039 -2.0237339 0.67041916
B  4.56780832 2.53561848 -0.3787556
C  6.14411582 -0.45376587 -1.11910565
H  5.74599108 0.19677137 -1.8967516
H  7.22991592 -0.34180635 -1.08678499
H  5.89595157 -1.49559815 -1.35582845
C  6.14636385 -0.83633336 1.28484304
H  5.98136873 -1.91346686 1.16419229
H  7.22250789 -0.65656729 1.32520966
H  5.69771499 -0.50908804 2.22322174
N  5.58403175 -0.06009819 0.18003259
H  5.80472949 2.29202674 0.49162845
H  5.82282078 1.42778124 0.37993527
F  5.1563254 2.64304497 -1.61897414
F  4.19965664 3.74218003 0.15302861
