program: Gaussian 16
title: MeQFBF2 TS1
version: ES64L-G16RevC.01
method: RwB97XD
basis: GenECP
operation: Freq
keyword: #N
keyword: Geom=AllCheck
keyword: Guess=TCheck
keyword: SCRF=Check
keyword: GenChk
keyword: RwB97XD/GenECP
keyword: Freq
converged: YES YES YES YES
title: Mulliken charges:
elementType: C C C N N N B H H H H H F F F
charge: -0.395826 -0.253844 -0.092191 0.165681 -0.363699 0.099773 0.260015 0.319602 -0.073053 0.223490 0.226365 0.220354 -0.105158 -0.105426 -0.126082
chargesum: -0.00000
title: Mulliken charges with hydrogens summed into heavy atoms:
elementType: C C C N N N B F F F
charge: 0.274383 -0.253844 -0.092191 0.165681 -0.363699 0.419374 0.186962 -0.105158 -0.105426 -0.126082
1716.lowfreq: -1297.7644 -6.6834 -0.0010 -0.0007 -0.0006 8.3853 14.9629 77.0069 80.1063
frequency: -1297.7643 76.9460 80.0989 96.7366 185.6844 200.8623 268.8618 329.1312 342.6749 406.7082 520.6091 585.1100 693.5515 697.3729 714.7177 715.2028 786.4845 860.2506 1003.8655 1081.0494 1105.8913 1158.0664 1175.9873 1183.2970 1238.1076 1312.5237 1324.7287 1378.6179 1396.7263 1456.3218 1486.9934 1502.2267 1546.7150 1676.0805 1764.8276 1897.7685 3086.2931 3174.9615 3202.0116
redmass: 1.1676 5.0308 1.1865 6.2495 11.2470 4.8413 3.8410 11.6271 8.4683 8.2403 6.5932 10.0333 5.8999 10.0916 2.6713 7.1650 1.8086 4.8786 4.0842 2.0162 3.4379 1.3272 9.8070 2.0483 1.0332 4.8252 8.3103 4.2519 6.4587 1.2968 1.0351 1.1436 4.7690 7.8618 1.1033 1.0776 1.0324 1.1075 1.1061
irintensity: 3469.7278 0.0924 0.1984 1.1536 0.1195 5.0379 2.5189 18.1898 0.9197 0.0647 18.9343 14.7206 31.9662 1.4023 8.7060 76.4617 4.2549 251.9683 297.3371 58.3378 67.7291 0.4771 357.2085 2.4870 49.5392 169.7543 5.4635 113.2014 109.8348 4.7816 19.1457 0.8808 61.3983 156.8984 630.7981 296.1796 11.7870 2.6933 0.0950
temp: 298.150 k
press: 1.00000 atm
elementType: 6 6 6 7 7 7 5 1 1 1 1 1 9 9 9
symmnumber: 1
zpe: 249505.5 jmol-1
zpe.correction: 0.095032 hartree
zpe.thermalcorrener: 0.104004 hartree
zpe.thermalcorrenthalpy: 0.104948 hartree
zpe.thermalcorrgfe: 0.059951 hartree
zpe.sumelectzpe: -605.868012 hartree
zpe.sumelectthermal: -605.859040 hartree
zpe.sumelectthermalent: -605.858096 hartree
zpe.sumelectthermalfe: -605.903093 hartree
dipole: 6.8040 3.4226 -1.5792
dipole: 7.7784
quadrupole: -67.4134 -71.5637 -61.6572
quadrupole: -14.6042 6.4246 5.5248
quadrupole: -0.5353 -4.6856 5.2209 -14.6042 6.4246 5.5248
hfenergy: -605.9630436 hartree
pointgroup: C01 [X(C3H5B1F3N3)]
dipole: 2.6769012 1.3465614 -0.6213242 debye
dipolederiv: 0.5771806 0.1128839 -0.0499418 0.1455382 0.1877595 0.0180938 -0.0598805 0.018792 0.200681 1.0684083 -0.7048138 0.4182228 -0.3725586 0.8553214 -0.3711989 0.2380206 -0.3864966 0.4140221 -0.6059373 0.2203573 -0.138881 -0.107288 -0.4873839 0.1895506 0.0388428 0.2041004 -0.2355705 -0.7550998 -0.245723 0.1047548 0.0238062 0.0773567 -0.0650458 -0.0461063 -0.0775677 -0.0062638 0.2160876 -0.1614114 0.0992285 -0.097189 -0.37299 0.1456708 0.0646405 0.1436169 -0.171071 -1.1629303 -0.3111384 0.1289079 -0.3713212 0.0045195 -0.1062177 0.1617433 -0.1042206 -0.1020544 1.4627432 0.1927357 -0.1171044 0.5312407 2.0529074 -0.1191316 -0.302855 -0.134237 1.8548611 1.4021748 0.7831726 -0.373525 0.7200002 0.5506058 -0.193825 -0.339581 -0.1910827 0.2287113 -0.3764491 -0.0101716 -0.0066548 -0.3050767 -0.6064808 0.2717243 0.1532716 0.2831286 -0.2309908 -0.0259333 -0.0379477 0.0208061 0.0287019 0.0143385 -0.0759774 0.0515804 -0.0531495 0.0655946 0.056656 0.0469196 -0.0261377 -0.0299124 0.0332337 0.0458424 0.0128996 0.0473804 0.1017747 -0.0171191 -0.0404644 0.0219757 -0.0309252 0.1091316 0.0128563 -0.050409 -0.010652 -0.0284723 -0.5714473 -0.2322826 -0.0557977 -0.426211 -1.2200034 -0.2029436 -0.0852838 -0.321303 -0.5856428 -0.6041936 -0.0970276 0.2619593 -0.1688123 -0.5418858 0.1207285 0.4369983 0.2513218 -1.2313684 -0.6641407 0.4849114 -0.2878129 0.4600072 -0.6564302 0.3298733 -0.2738816 0.330369 -0.274211 unknown
polarizability: 100.8702066|10.1118844|78.7332756|-3.5649634|-13.4208898|60.3519905 unknown
InChI: InChI=1/C3H5BF3N3/c1-10-3(5)2(4(6)7)8-9-10/h4,8H,1H3
charge 0 multiplicity 1
15 atoms
C  1.61230612 -0.08573832 -0.05975162
C  -0.26552341 -1.6016401 0.68363259
C  -1.62698707 -1.55196027 0.60069813
N  0.22146327 -0.48332353 0.09890547
N  -0.7741963 0.27303355 -0.3520227
N  -1.84933232 -0.38179814 -0.04202141
B  -3.05211663 -2.23430986 0.91422795
H  -3.15897456 -0.52917678 -0.01504939
H  -3.84054561 -1.17308023 0.30609013
H  2.13521268 -0.81917187 -0.67208341
H  1.61376977 0.88271673 -0.55327789
H  2.08380003 -0.00853863 0.91902548
F  -3.37216677 -3.36060681 0.20574966
F  -3.4525465 -2.26407638 2.22265846
F  0.55757166 -2.4841519 1.19523672
