program: Gaussian 16
title: f_indenoPy
version: ES64L-G16RevC.02
method: RwB97XD
basis: GenECP
operation: Freq
keyword: #N
keyword: Geom=AllCheck
keyword: Guess=TCheck
keyword: SCRF=Check
keyword: GenChk
keyword: RwB97XD/GenECP
keyword: Freq
converged: YES YES YES YES
title: Mulliken charges:
elementType: C C C C C C H H H C H H C C C C C H H H N B H H F F
charge: 0.068565 -0.231065 -0.597826 0.124444 -0.326744 -0.113191 0.237482 0.224199 0.214966 -0.566031 0.218520 0.227258 -1.122997 0.238625 0.283105 0.646072 -0.631702 0.267261 0.264532 0.254406 0.117458 0.198899 -0.028756 0.278886 -0.141780 -0.104586
chargesum: -0.00000
title: Mulliken charges with hydrogens summed into heavy atoms:
elementType: C C C C C C C C C C C C N B F F
charge: 0.068565 -0.231065 -0.597826 0.361925 -0.102546 0.101775 -0.120252 -1.122997 0.238625 0.550366 0.910605 -0.377296 0.396343 0.170143 -0.141780 -0.104586
chargesum: 0.00000
1716.lowfreq: -974.3171 -14.2245 0.0007 0.0007 0.0009 2.6262 9.9986 54.2381 86.9384
frequency: -974.3169 53.8649 86.8811 112.1234 151.7560 210.8295 243.7794 245.1769 262.9166 297.2966 349.7968 422.5783 438.4634 476.2462 496.9416 540.8773 556.3160 568.1088 582.7910 643.4197 668.4166 705.3235 753.3235 786.0272 798.9446 812.9943 821.3400 837.5338 860.2825 907.7599 932.0188 960.6445 989.0503 1017.6902 1019.9681 1046.8951 1056.8879 1079.8897 1099.6766 1113.3958 1139.1342 1163.5508 1175.7467 1196.1613 1206.8880 1208.8894 1262.2033 1269.1803 1286.2971 1301.7316 1336.4655 1359.2325 1390.3644 1447.8322 1465.7783 1489.4225 1514.6028 1535.9296 1651.9719 1662.4661 1677.4934 1681.6574 1755.7186 2201.9288 3064.7230 3105.0105 3184.2319 3195.8002 3202.0680 3207.6790 3215.2939 3232.6250
redmass: 1.1736 7.8666 4.6088 6.5551 6.1349 6.8859 3.5233 2.7491 6.6748 6.9109 6.1111 5.5036 3.8616 2.9313 8.6606 3.8726 4.2133 5.8227 3.3767 5.4572 6.1779 2.9456 3.8500 2.9719 1.3357 1.3312 4.0458 2.0617 5.0769 5.7254 1.6581 1.4801 1.5292 1.3889 1.3711 5.1480 3.4410 2.3449 4.8362 2.3490 1.6280 1.3158 1.1425 1.3093 1.4901 1.7684 1.7671 4.8542 1.6660 2.6815 2.1169 2.3319 3.2249 1.1358 2.5215 2.6457 2.7753 3.3981 6.0405 6.5893 7.5154 6.8885 1.1058 1.0450 1.0609 1.1025 1.0868 1.0920 1.0912 1.0973 1.0914 1.0982
irintensity: 3525.8205 1.2223 0.9339 2.7488 2.4477 5.8681 12.1672 10.5396 5.5979 2.5362 2.0170 1.6317 0.1402 1.2268 5.7473 6.0078 0.6907 1.6047 1.2568 16.5835 67.7848 14.0794 37.2255 3.0602 97.1024 2.2705 21.7274 48.1937 36.0971 26.4436 4.9282 0.4917 1.0463 0.1378 2.5846 82.9319 84.8566 22.1450 181.0220 69.8388 17.7225 149.7523 1.1140 59.1067 13.2212 9.8068 49.2730 119.6930 5.8674 60.2517 3.1911 73.1197 13.0164 13.1446 27.1857 56.9539 0.6133 44.3334 20.6916 5.3320 10.1872 148.3019 201.8227 1780.4304 9.1644 3.1542 0.1898 13.3222 7.1351 31.0395 3.3474 7.8556
temp: 298.150 k
press: 1.00000 atm
elementType: 6 6 6 6 6 6 1 1 1 6 1 1 6 6 6 6 6 1 1 1 7 5 1 1 9 9
symmnumber: 1
zpe: 507194.5 jmol-1
zpe.correction: 0.193180 hartree
zpe.thermalcorrener: 0.205011 hartree
zpe.thermalcorrenthalpy: 0.205955 hartree
zpe.thermalcorrgfe: 0.154854 hartree
zpe.sumelectzpe: -742.439512 hartree
zpe.sumelectthermal: -742.427681 hartree
zpe.sumelectthermalent: -742.426737 hartree
zpe.sumelectthermalfe: -742.477839 hartree
dipole: -8.4177 4.0841 -0.9133
dipole: 9.4006
quadrupole: -82.0575 -84.9560 -97.6888
quadrupole: 12.8658 0.3241 4.9967
quadrupole: 6.1766 3.2781 -9.4547 12.8658 0.3241 4.9967
hfenergy: -742.6326923 hartree
pointgroup: C01 [X(C12H10B1F2N1)]
dipole: -3.3117784 1.6068082 -0.3593285 debye
dipolederiv: 0.1908536 -0.1311668 -0.0331277 0.0082686 -0.0929098 -0.0056503 -0.0202018 0.0070511 -0.0625824 -0.3368037 -0.3372245 -0.0310322 -0.0734194 -0.201543 -0.0093807 0.0357249 0.0189706 -0.0368264 -0.1076638 0.1738077 -0.0069024 0.0412392 -0.3830557 -0.025111 -0.041176 -0.1072354 -0.1878136 0.1128942 -0.0855412 -0.0156588 -0.2212376 -0.2794105 -0.0099307 -0.0421435 -0.0113972 -0.1403474 -0.0354917 -0.0882507 -0.0196796 0.0465885 0.117913 0.0214628 0.0058953 0.0294703 -0.1340188 -0.2013095 0.0776441 0.0100396 0.0048907 0.1758511 0.0383745 -0.0042848 0.0302951 -0.1522831 -0.0900683 0.0262684 0.0088874 0.0586602 0.0793223 -0.0073003 0.0133095 -0.0004642 0.1419195 -0.044717 -0.1084535 -0.0026142 -0.107716 -0.0040238 -0.0100743 0.0007771 -0.011475 0.1505018 0.0773419 0.0531091 0.0076855 0.0084862 -0.109119 -0.0264473 0.0036466 -0.0276385 0.1482091 0.009806 0.0520296 0.0153078 0.0753649 -0.027821 -0.0298723 0.0161581 -0.0422873 0.1925766 -0.0071476 -0.0041792 -0.0327924 0.0017913 0.0026571 0.0477689 -0.0595739 0.0938561 0.0264051 0.0020974 -0.0164973 0.0260326 -0.0195206 0.0364796 -0.0452559 0.0557448 -0.0870157 -0.0105947 1.0498013 0.7375203 0.0799373 -0.1308607 0.2692927 0.021758 -0.0417441 0.0139115 0.1425845 -1.0024554 -0.4032675 -0.0359956 0.3350806 0.3293092 0.039296 0.0288926 0.0463966 -0.0546603 -0.0126272 -0.4605194 -0.0469831 0.3221086 0.3359224 0.0370381 0.0564399 0.0438281 0.0065105 0.6022044 0.123495 0.0070707 0.2878985 0.4219124 0.0643858 0.0405906 0.0742216 -0.0611233 -0.0145942 0.2654028 0.0354176 -0.4139141 -0.584231 -0.0473877 -0.0821085 -0.0748319 -0.165626 0.0699279 -0.0081309 0.0020199 -0.0585567 -0.0350186 -0.0285188 -0.0007034 -0.025573 0.1399371 0.0008156 0.0629284 0.0105884 0.1011281 0.0428939 -0.0150583 0.0173155 -0.0131426 0.1357796 -0.0378099 -0.0600053 -0.0046911 -0.0608502 0.0589521 -0.0142059 -0.0057318 -0.0131526 0.1626971 -1.1605253 0.4472842 0.1239607 0.1952462 -0.456963 -0.0428329 0.290114 -0.0942699 -0.1878905 1.9489389 -0.2684224 -0.1075865 -0.1790731 1.7496845 -0.0791772 0.3749873 -0.1965165 1.4953126 -0.9998642 0.1072615 -0.069936 -0.1458094 -0.17139 -0.0882626 -0.1277083 -0.0624641 -0.1356026 1.8464808 -0.6024646 -0.244656 -0.5060563 0.2299581 0.0126378 -0.5538197 0.1033851 0.1194542 -0.4882609 0.0402981 0.0198766 0.1369396 -0.8324963 0.31826 -0.2255186 0.4055778 -0.9757254 -1.3718236 0.4070742 0.3048315 0.2933231 -0.6721667 -0.1165159 0.2651183 -0.0995002 -0.5567932 unknown
polarizability: 253.5228197|24.2996582|207.3533618|-0.7005632|12.7744741|98.6614159 unknown
InChI: InChI=1/C12H9BF2N.H/c14-13(15)10-5-1-3-8-7-9-4-2-6-16-12(9)11(8)10;/h1-6,13H,7H2;
charge 0 multiplicity 1
26 atoms
C  -0.01207397 1.90760963 0.19256861
C  0.26196962 0.54266689 0.05244184
C  1.55162805 0.00944416 -0.02376941
C  2.58790315 0.94446136 0.0111421
C  2.33738366 2.31223028 0.14245054
C  1.03905454 2.80905335 0.24301146
H  3.61468277 0.60144407 -0.05787056
H  3.17316228 3.00301525 0.17299089
H  0.86370816 3.87362703 0.35420475
C  -1.50621351 2.14860387 0.2678845
H  -1.8568571 2.81291689 -0.52765142
H  -1.79559631 2.60159462 1.2211275
C  -1.01541822 -0.1491606 -0.01358659
C  -2.07153838 0.75808287 0.11703987
C  -2.43280346 -1.93221139 -0.27460959
C  -3.35954747 0.2669871 0.06477603
C  -3.5358865 -1.10881612 -0.12872807
H  -2.53414433 -2.99736989 -0.44379032
H  -4.22004795 0.91979297 0.16259362
H  -4.5283509 -1.53783527 -0.17501031
N  -1.1826804 -1.45353532 -0.2121735
B  1.82537038 -1.57154313 -0.04969383
H  0.91879532 -2.20061381 -0.87112716
H  0.07705713 -2.01329418 -0.55590129
F  1.66285077 -2.19715072 1.18296852
F  2.9928737 -1.95764591 -0.68973819
