program: Gaussian 16
title: MeQNH2BF2 TS1
version: ES64L-G16RevC.01
method: RwB97XD
basis: GenECP
operation: Freq
keyword: #N
keyword: Geom=AllCheck
keyword: Guess=TCheck
keyword: SCRF=Check
keyword: GenChk
keyword: RwB97XD/GenECP
keyword: Freq
converged: YES YES YES YES
title: Mulliken charges:
elementType: C C C N N N B H H H H H F F N H H
charge: -0.430473 -0.055354 -0.533742 0.171373 -0.354583 0.113393 0.244691 0.305105 -0.070567 0.214941 0.221208 0.218663 -0.109940 -0.105906 -0.435332 0.325123 0.281401
chargesum: -0.00000
title: Mulliken charges with hydrogens summed into heavy atoms:
elementType: C C C N N N B F F N
charge: 0.224338 -0.055354 -0.533742 0.171373 -0.354583 0.418498 0.174124 -0.109940 -0.105906 0.171191
1716.lowfreq: -1266.4723 -13.3097 0.0006 0.0006 0.0011 9.2851 10.6498 74.6455 91.2448
frequency: -1266.4721 74.5469 91.2286 120.9101 178.3273 187.0175 220.0751 278.3021 321.5358 332.1359 409.7190 502.0391 578.5594 619.7113 691.3774 698.1180 721.2045 741.2353 777.8943 844.8597 995.3773 1049.2841 1070.4323 1151.2404 1156.0730 1164.7766 1229.2525 1230.0585 1305.2875 1331.2557 1386.6487 1402.1429 1454.3874 1487.9245 1505.1770 1556.9823 1637.5968 1689.5018 1750.3308 1923.4294 3069.4237 3148.7651 3194.2200 3598.2143 3695.3787
redmass: 1.1788 5.2680 7.5599 1.0666 2.0510 4.7232 1.6399 2.9228 4.9162 9.5789 6.8013 4.1086 9.2977 1.5278 4.4010 4.4634 2.7839 3.5784 2.2780 3.8407 3.1991 2.0379 2.2769 7.9365 1.3792 1.9044 1.0483 2.0337 3.5818 7.4101 5.1082 6.8734 1.2275 1.0493 1.0917 5.5085 1.6956 2.2064 1.0910 1.0820 1.0343 1.1063 1.1038 1.0495 1.0977
irintensity: 3238.0992 0.5843 3.7923 6.0919 17.6906 7.6347 27.5689 3.3157 8.9859 10.4287 1.8790 5.8028 6.2547 259.6892 13.1057 53.7200 64.6459 23.9106 1.7145 245.8245 302.7018 56.4220 104.5644 345.6103 15.5284 7.2752 43.6464 52.4597 98.5360 6.9626 105.3299 82.1739 6.7548 17.2245 4.2032 44.0032 20.9254 233.1201 530.9696 511.1076 20.2843 7.2124 0.2115 48.8055 53.8127
temp: 298.150 k
press: 1.00000 atm
elementType: 6 6 6 7 7 7 5 1 1 1 1 1 9 9 7 1 1
symmnumber: 1
zpe: 314450.1 jmol-1
zpe.correction: 0.119768 hartree
zpe.thermalcorrener: 0.129437 hartree
zpe.thermalcorrenthalpy: 0.130382 hartree
zpe.thermalcorrgfe: 0.084427 hartree
zpe.sumelectzpe: -561.976799 hartree
zpe.sumelectthermal: -561.967129 hartree
zpe.sumelectthermalent: -561.966185 hartree
zpe.sumelectthermalfe: -562.012139 hartree
dipole: 8.1602 0.9366 -1.0252
dipole: 8.2775
quadrupole: -69.1365 -62.9772 -64.7213
quadrupole: -18.3982 6.1674 1.8819
quadrupole: -3.5248 2.6345 0.8904 -18.3982 6.1674 1.8819
hfenergy: -562.0965665 hartree
pointgroup: C01 [X(C3H7B1F2N4)]
dipole: 3.2104585 0.3684806 -0.4033353 debye
dipolederiv: 0.5363004 0.1514447 -0.079263 0.1318835 0.2049486 0.0125555 -0.058384 0.035313 0.2116874 0.9057708 -0.8046411 0.5551941 -0.3963519 0.7117045 -0.356616 0.3410973 -0.3750503 0.4025493 -0.7032936 0.3637659 -0.2555015 -0.1509613 -0.6010369 0.2156562 0.0681933 0.2083576 -0.2932256 -0.6729696 -0.3318164 0.1501483 0.0214818 0.0663251 -0.0565469 -0.1106401 -0.0926676 -0.048277 0.1290927 -0.122705 0.0751518 -0.0578481 -0.5376425 0.2207566 0.05064 0.2344166 -0.236042 -1.1260928 -0.2837921 0.0754563 -0.3349283 0.081264 -0.1522989 0.1172805 -0.1579575 -0.0648867 1.4933155 0.1517798 -0.1030926 0.5386212 2.0253903 -0.0928091 -0.3149357 -0.1228567 1.8189522 1.346544 0.7772419 -0.3213064 0.7804607 0.5940375 -0.1852543 -0.3244193 -0.1843883 0.2084079 -0.3812814 0.0025058 -0.024619 -0.2971464 -0.6012061 0.2539467 0.1373804 0.2787028 -0.221408 -0.0507021 -0.038287 0.0388447 0.0467607 0.0034088 -0.0907897 0.0720102 -0.0668295 0.0336282 0.0670681 0.0516939 -0.0198332 -0.036509 0.0129515 0.0421478 0.0163457 0.0459255 0.1073425 -0.0213444 -0.046524 0.0169661 -0.0141195 0.1094147 0.0240194 -0.0614818 -0.0132622 -0.034624 -0.5715655 -0.1991494 -0.0556445 -0.4205025 -1.2276184 -0.2257963 -0.0748534 -0.3274453 -0.5912092 -0.6322422 -0.1011782 0.2697956 -0.1930397 -0.549471 0.1331485 0.4558675 0.2591242 -1.2039232 -0.7681947 0.4784412 -0.4279422 0.2890228 -0.6821631 0.1530766 -0.4955667 0.3645249 -0.6926612 0.1612118 -0.0244806 0.0255532 0.0025583 0.2214637 0.0174425 0.0329126 -0.0617298 0.3600638 0.2883829 -0.0242994 0.0800923 0.0906177 0.1682293 0.0873616 0.1485537 -0.0241775 0.2436257 unknown
polarizability: 111.7281492|7.268341|92.5417979|0.0012164|-17.0184063|69.6164955 unknown
InChI: InChI=1/C3H7BF2N4/c1-10-3(7)2(4(5)6)8-9-10/h4,8H,7H2,1H3
charge 0 multiplicity 1
17 atoms
C  1.6122507 0.06021584 -0.00265952
C  -0.18888825 -1.55418159 0.69144253
C  -1.56335552 -1.52396472 0.57060062
N  0.24358164 -0.40263959 0.11384665
N  -0.77303422 0.32439872 -0.367885
N  -1.82549339 -0.36419301 -0.07202881
B  -2.94730263 -2.27349247 0.86036288
H  -3.14056399 -0.58460799 -0.06145523
H  -3.79378842 -1.24623339 0.24369777
H  2.17670418 -0.58816643 -0.67513278
H  1.58624876 1.06875193 -0.40760075
H  2.07647454 0.06722063 0.98440368
F  -3.21527476 -3.41521361 0.14448541
F  -3.37903341 -2.3413555 2.16182825
N  0.67881665 -2.42625101 1.30981
H  0.23488111 -3.27320819 1.63133987
H  1.53149042 -2.62436144 0.80522515
