program: Gaussian 16
title: MeIM TS1
version: ES64L-G16RevC.01
method: RwB97XD
basis: GenECP
operation: Freq
keyword: #N
keyword: Geom=AllCheck
keyword: Guess=TCheck
keyword: SCRF=Check
keyword: GenChk
keyword: RwB97XD/GenECP
keyword: Freq
converged: YES YES YES YES
title: Mulliken charges:
elementType: C C H C N N N B F F H H H H H
charge: -0.389305 -0.391346 0.252055 -0.383505 0.242232 -0.325742 0.067698 0.262307 -0.108236 -0.108085 0.309367 -0.066790 0.204721 0.217060 0.217568
chargesum: -0.00000
title: Mulliken charges with hydrogens summed into heavy atoms:
elementType: C C C N N N B F F
charge: 0.250045 -0.139291 -0.383505 0.242232 -0.325742 0.377065 0.195517 -0.108236 -0.108085
chargesum: 0.00000
1716.lowfreq: -1294.5134 -7.4140 -0.0010 -0.0008 -0.0005 2.3475 14.6321 57.4627 86.9052
frequency: -1294.5133 55.8944 86.8595 108.5981 218.7455 230.2951 326.5603 400.9746 415.9347 574.4105 667.0187 699.3489 711.4882 782.6105 803.8035 852.2580 982.0131 1078.5225 1088.0995 1102.1491 1155.0090 1165.9057 1175.1701 1190.7699 1236.4836 1333.1848 1365.5382 1393.4895 1453.9076 1483.5103 1487.7135 1516.1479 1604.6923 1762.1009 1902.4412 3084.1043 3171.1033 3198.4883 3301.2914
redmass: 1.1703 1.0505 6.3633 7.9213 4.9684 4.1242 9.7085 7.7634 3.5303 11.9153 3.1825 4.7101 2.6969 1.7796 4.1361 1.4495 4.1438 1.5965 3.1967 3.2673 1.3479 9.7094 1.8519 2.1530 1.0308 5.5455 4.2281 5.0181 1.4363 1.9826 1.0764 1.3755 4.8132 1.0999 1.0768 1.0328 1.1071 1.1056 1.1020
irintensity: 3473.8489 0.0294 0.0020 6.7220 0.8698 1.1967 14.6051 0.0394 4.6172 4.1155 9.5617 48.5603 3.2347 1.1788 274.5765 32.2075 264.8495 0.4467 66.1036 94.7177 2.1538 352.9581 19.6316 150.2055 46.0750 27.4540 131.6864 6.2116 6.9143 18.5864 17.2272 6.3152 0.1396 556.6341 344.5070 16.9345 4.2768 0.3680 3.8280
temp: 298.150 k
press: 1.00000 atm
elementType: 6 6 1 6 7 7 7 5 9 9 1 1 1 1 1
symmnumber: 1
zpe: 270156.5 jmol-1
zpe.correction: 0.102897 hartree
zpe.thermalcorrener: 0.111075 hartree
zpe.thermalcorrenthalpy: 0.112020 hartree
zpe.thermalcorrgfe: 0.068807 hartree
zpe.sumelectzpe: -506.631461 hartree
zpe.sumelectthermal: -506.623283 hartree
zpe.sumelectthermalent: -506.622339 hartree
zpe.sumelectthermalfe: -506.665551 hartree
dipole: 7.7564 2.3441 -0.9676
dipole: 8.1605
quadrupole: -64.6038 -63.7793 -57.2098
quadrupole: -17.1975 7.4185 3.1717
quadrupole: -2.7395 -1.9150 4.6545 -17.1975 7.4185 3.1717
hfenergy: -506.7343584 hartree
pointgroup: C01 [X(C3H6B1F2N3)]
dipole: 3.0516081 0.922252 -0.3806749 debye
dipolederiv: 0.5713475 0.1052693 -0.0290218 0.1428931 0.1923199 0.0243908 -0.0764619 0.0189132 0.199038 0.1712619 -0.1937054 0.1083867 0.1432643 -0.0124209 -0.0141968 -0.0755771 -0.025045 -0.0396859 0.0760079 0.0251093 -0.0160588 0.0168023 0.1329476 0.0358222 -0.0108428 0.036097 0.1824133 -0.4409928 0.1139973 -0.0713413 -0.0832288 -0.3947312 0.1346249 0.0341584 0.1370825 -0.2078872 -0.6751923 -0.1932489 0.0774636 -0.0641282 0.2198867 -0.151176 0.0409853 -0.1456847 0.0108447 0.2185395 -0.1148739 0.0707274 -0.0354702 -0.3803876 0.1552276 0.0243006 0.1462156 -0.155065 -1.1869414 -0.3302112 0.1361972 -0.4256713 -0.1061209 -0.0446509 0.191295 -0.0348781 -0.1296352 1.4304225 0.1810939 -0.1033798 0.5164057 2.0465625 -0.1217684 -0.2776461 -0.1340456 1.8410892 -0.5772705 -0.2387122 -0.066021 -0.4261819 -1.2089142 -0.2153138 -0.0940227 -0.3313558 -0.5964319 -0.6030292 -0.0979162 0.2605046 -0.176939 -0.5498972 0.1379727 0.4270059 0.263327 -1.2312029 1.4083103 0.7811568 -0.3652427 0.7321998 0.5466127 -0.1881704 -0.3428545 -0.1866652 0.226008 -0.3876484 -0.0077866 -0.0053348 -0.3059348 -0.6130871 0.264227 0.1494518 0.273084 -0.221121 -0.025152 -0.0302599 0.0220484 0.0480973 -0.006807 -0.0688332 0.0519371 -0.0496009 0.0798309 0.0522221 0.0425556 -0.0354489 -0.0390876 0.0344019 0.0557815 0.017577 0.060576 0.0818308 -0.031885 -0.0424681 0.0165213 -0.0430208 0.0996347 -0.0039371 -0.0593062 -0.0280199 -0.0400259 unknown
polarizability: 100.9877035|10.2124067|78.8190039|-3.6678258|-12.4801315|60.2890115 unknown
InChI: InChI=1/C3H6BF2N3/c1-9-2-3(4(5)6)7-8-9/h2,4,7H,1H3
charge 0 multiplicity 1
15 atoms
C  1.60224119 -0.07250797 -0.06037603
C  -0.25495262 -1.62411859 0.67165661
H  0.40546055 -2.37210201 1.07628842
C  -1.62119218 -1.53379064 0.5868
N  0.21628778 -0.48850264 0.09679173
N  -0.76410363 0.28952843 -0.33261834
N  -1.85089294 -0.3526846 -0.03068496
B  -3.04242166 -2.21723124 0.89777146
F  -3.37708509 -3.3298095 0.17003278
F  -3.43785901 -2.27594429 2.20916063
H  -3.16427761 -0.4995304 0.00562384
H  -3.84539519 -1.14188311 0.31819575
H  2.1606415 -0.85790546 -0.56781213
H  1.60805588 0.8334188 -0.66134214
H  2.03884244 0.12750013 0.91766206
