program: Gaussian 16
title: f_nmeimidazole_ts1
version: ES64L-G16RevC.02
frameworkgroup: C1[X(C4H7BF2N2)]
method: RwB97XD
basis: GenECP
operation: Freq
keyword: #N
keyword: Geom=AllCheck
keyword: Guess=TCheck
keyword: SCRF=Check
keyword: GenChk
keyword: RwB97XD/GenECP
keyword: Freq
converged: YES YES YES YES
title: Mulliken charges:
elementType: C C H C N N B H H H H H C H F F
charge: -0.398453 -0.249108 0.232257 -0.436536 0.022489 -0.069703 0.285779 0.246510 -0.077880 0.214008 0.165849 0.213820 -0.162192 0.247011 -0.116928 -0.116924
chargesum: 0.00000
title: Mulliken charges with hydrogens summed into heavy atoms:
elementType: C C C N N B C F F
charge: 0.195224 -0.016852 -0.436536 0.022489 0.176808 0.207899 0.084820 -0.116928 -0.116924
1716.lowfreq: -1238.1377 -42.6925 -14.7945 -0.0013 -0.0012 -0.0011 3.4819 26.0802 85.9566
frequency: -1238.1377 -11.8797 85.4526 91.7538 211.9950 218.0963 329.7723 384.6112 401.9099 575.5878 633.1938 681.4171 685.1800 760.4675 802.9429 803.9976 842.3156 934.4078 1054.0344 1073.1341 1098.7348 1121.3344 1152.9162 1153.7283 1205.5348 1232.4789 1271.1138 1312.5969 1408.1592 1441.2163 1463.5771 1486.4468 1520.6749 1562.9320 1618.7258 1726.3245 1959.7855 3073.3727 3157.1009 3172.7947 3280.3628 3288.5659
redmass: 1.1874 1.0528 6.2342 6.0179 4.9065 4.0048 8.8459 7.0677 3.2804 11.4994 2.7844 1.8597 4.5153 1.4945 1.7367 3.8509 1.4559 3.6304 2.3285 2.5519 1.5936 1.9716 1.7601 3.5535 1.9673 1.0267 1.3749 6.8010 4.7281 3.9517 1.2738 1.0361 1.1619 3.6044 3.8843 1.1306 1.0970 1.0328 1.1067 1.1057 1.0998 1.1012
irintensity: 3519.2993 0.0026 2.0761 0.1648 0.0427 0.4619 17.7370 2.7605 1.4708 3.3839 32.9521 1.5517 42.9992 0.4322 12.6775 314.9410 38.3534 232.2982 71.8813 37.7784 7.3367 7.2894 97.8043 267.4812 221.6374 36.3487 35.6439 10.1769 21.2533 78.1247 12.2097 15.7263 33.2635 135.3204 1.7725 398.5868 605.7856 30.1373 8.5045 7.0115 3.0822 0.2445
temp: 298.150 k
press: 1.00000 atm
elementType: 6 6 1 6 7 7 5 1 1 1 1 1 6 1 9 9
symmnumber: 1
zpe: 300733.7 jmol-1
zpe.correction: 0.114543 hartree
zpe.thermalcorrener: 0.122135 hartree
zpe.thermalcorrenthalpy: 0.123079 hartree
zpe.thermalcorrgfe: 0.081552 hartree
zpe.sumelectzpe: -490.616169 hartree
zpe.sumelectthermal: -490.608578 hartree
zpe.sumelectthermalent: -490.607634 hartree
zpe.sumelectthermalfe: -490.649161 hartree
dipole: 9.6481 0.2182 0.0001
dipole: 9.6505
quadrupole: -49.5586 -46.7909 -57.6985
quadrupole: -2.7888 -0.0001 0.0003
quadrupole: 1.7907 4.5584 -6.3491 -2.7888 -0.0001 0.0003
hfenergy: -490.7307127 hartree
pointgroup: C01 [X(C4H7B1F2N2)]
dipole: -3.7844944 0.0355641 0.3034527 debye
dipolederiv: 0.6148282 0.1960741 0.0386861 0.1502195 0.2446278 -0.0099725 0.0231307 -0.0133879 0.2334435 0.1905526 0.1921515 0.0427758 -0.1591284 -0.0065858 0.0501235 -0.0785041 0.0231963 -0.1022524 0.0885899 -0.0347674 -0.0031644 -0.018711 0.0517438 -0.0510349 0.0023788 -0.0498186 0.1862838 -0.4962302 -0.1313571 -0.0228098 0.1269299 -0.277934 -0.0355667 0.0664141 -0.0157491 -0.2135932 -0.8219444 -0.368475 -0.076731 -0.3474504 -0.1110415 0.0456758 -0.0698625 0.0471188 -0.1441276 -1.5999694 -0.1390831 0.0565321 -0.3166747 -0.3728237 -0.020907 -0.004871 -0.0345371 -0.2534547 1.9785019 -0.2403853 -0.0980371 -0.6178224 1.6151147 -0.0105178 -0.2283786 -0.0395787 1.7871611 1.9631468 -0.0724787 -0.1663353 -0.00067 0.0765144 -0.0174066 -0.1415454 -0.0118688 0.1338727 -0.6531892 0.0598212 0.0643966 0.3502229 -0.4600575 -0.1565381 0.1646973 -0.1341899 -0.1438585 -0.0158871 -0.0068043 -0.0345443 -0.084588 -0.0223247 0.0730437 0.0196146 0.0955445 0.0326593 -0.0005084 -0.0113041 0.0047039 0.092042 -0.0268243 -0.0546662 0.0403193 -0.046812 0.0924809 -0.018047 -0.0388931 0.0178546 -0.0633569 0.0759922 -0.0268866 -0.0714974 -0.0572101 -0.0631199 0.5778849 0.2567976 0.0505331 0.2585308 0.2714024 0.0454409 0.051284 0.0455574 0.0940311 0.0324362 0.0300885 0.0223536 0.0152673 0.1148312 -0.0265157 0.017163 -0.0275909 0.1773363 -0.8603586 0.028602 0.3600563 0.1357532 -0.4539102 -0.0349066 0.5580632 -0.0746152 -1.1005611 -0.9798063 0.2800132 -0.2562702 0.4794362 -0.7187247 0.2306347 -0.3484059 0.2939413 -0.7163011 unknown
polarizability: 110.218964|3.1563003|83.4433821|-2.9739871|8.7430965|60.6724741 unknown
InChI: InChI=1/C4H7BF2N2/c1-9-2-4(5(6)7)8-3-9/h2-3,5,8H,1H3
charge 0 multiplicity 1
16 atoms
C  -3.24930704 -0.62250889 -0.04170123
C  -0.75070287 -0.85807226 -0.31542064
H  -0.82000165 -1.87601482 -0.66170785
C  0.31801155 -0.03468494 -0.11321807
N  -1.87915693 -0.13847582 0.01990039
N  -0.17186104 1.16750447 0.33969896
B  1.91484286 0.05742219 -0.20427792
H  1.07147336 1.66866323 0.41709051
H  2.0046665 1.45749118 0.27232145
H  -3.36960404 -1.48313284 0.6164982
H  -3.92053969 0.17101236 0.28242409
H  -3.49813736 -0.90504337 -1.06474354
C  -1.48453877 1.08690661 0.41282139
H  -2.16360105 1.86104572 0.73245996
F  2.48916995 0.09342045 -1.45074002
F  2.65529924 -0.65222526 0.70837833
