program: Gaussian 16
title: MePBF2 TS1
version: ES64L-G16RevC.01
method: RwB97XD
basis: GenECP
operation: Freq
keyword: #N
keyword: Geom=AllCheck
keyword: Guess=TCheck
keyword: SCRF=Check
keyword: GenChk
keyword: RwB97XD/GenECP
keyword: Freq
converged: YES YES YES YES
title: Mulliken charges:
elementType: C H H C C H H C N N B H H F F H
charge: -1.035491 0.175261 0.175276 -0.139879 -0.047326 0.247401 0.248165 0.134630 -0.067527 -0.249892 0.352304 0.009118 0.204513 -0.090694 -0.090680 0.174820
chargesum: -0.00000
title: Mulliken charges with hydrogens summed into heavy atoms:
elementType: C C C C N N B F F
charge: -0.510135 0.107523 0.200839 0.134630 0.136987 -0.249892 0.361422 -0.090694 -0.090680
1716.lowfreq: -981.7170 -8.7928 -0.0008 0.0008 0.0008 5.4629 7.2569 42.9338 75.8641
frequency: -981.7164 42.8342 75.8593 78.8388 204.8577 257.9017 335.0161 382.3948 392.1446 589.1375 633.6920 667.0169 668.2442 724.9234 813.5121 860.7066 884.9411 966.5506 1007.7377 1031.3057 1071.0005 1088.1536 1115.7156 1120.6273 1187.2694 1227.4625 1258.0947 1321.5673 1410.2837 1429.7749 1446.6555 1475.7174 1485.8778 1515.4013 1630.5148 1710.7061 2337.3015 3052.8215 3119.0187 3137.6521 3264.7167 3273.7347
redmass: 1.2559 1.0401 5.5554 7.2247 4.6310 3.7789 6.3301 3.9018 7.0083 9.6663 2.5082 2.6565 4.5941 1.6190 3.7109 1.3612 1.3218 3.6181 1.3714 3.2532 1.4768 1.8225 2.2509 1.0216 2.8593 11.7342 1.4610 3.4392 1.6534 3.2606 3.0561 2.2586 1.0400 1.4985 5.0611 1.0780 1.0452 1.0368 1.1020 1.1020 1.0984 1.0996
irintensity: 1993.1778 0.0022 0.9401 1.6427 0.9520 1.3896 7.9591 8.9710 2.9274 8.9072 36.3247 0.3946 34.1221 3.4365 345.9546 22.1991 14.8113 210.0592 4.1318 56.6759 2.9139 36.7217 29.8365 12.7615 353.2446 410.1242 13.1055 56.7509 65.0842 17.8652 101.3538 106.0469 10.7276 9.0678 20.3310 179.6508 1404.7038 31.6885 15.4801 16.3130 0.7157 0.5050
temp: 298.150 k
press: 1.00000 atm
elementType: 6 1 1 6 6 1 1 6 7 7 5 1 1 9 9 1
symmnumber: 1
zpe: 300847.0 jmol-1
zpe.correction: 0.114587 hartree
zpe.thermalcorrener: 0.123043 hartree
zpe.thermalcorrenthalpy: 0.123987 hartree
zpe.thermalcorrgfe: 0.079896 hartree
zpe.sumelectzpe: -490.626391 hartree
zpe.sumelectthermal: -490.617934 hartree
zpe.sumelectthermalent: -490.616990 hartree
zpe.sumelectthermalfe: -490.661081 hartree
dipole: -2.7979 -0.4331 3.2659
dipole: 4.3223
quadrupole: -67.7552 -60.5241 -75.5939
quadrupole: -23.1760 22.5799 19.6984
quadrupole: 0.2025 7.4337 -7.6362 -23.1760 22.5799 19.6984
hfenergy: -490.7409771 hartree
pointgroup: C01 [X(C4H7B1F2N2)]
dipole: -1.1007673 -0.170377 1.284912 debye
dipolederiv: 0.1126716 -0.0057747 0.0416625 0.007256 0.1358942 0.0146306 0.0143258 0.0266057 0.0731555 -0.058618 0.0939703 -0.0873681 0.0535733 0.0441728 0.0709828 0.004873 0.0377322 0.0055421 0.0819777 0.0288697 0.0528048 0.0446339 -0.0415691 -0.0946962 0.0578107 -0.0261392 -0.0770158 0.2955194 -0.0799471 -0.0848551 -0.244272 0.0691525 -0.0419862 0.2901105 -0.1750543 0.1315752 0.2390374 -0.0713675 -0.0821778 0.0315763 -0.0252499 -0.1125572 -0.3165667 -0.030081 0.2636977 0.0083394 0.046742 0.0291414 0.0551901 0.1500165 0.0174716 0.0098387 0.0244974 0.1138557 0.0542671 0.0572937 -0.0165109 0.0504711 0.1586156 0.0440915 -0.0015283 0.039118 0.1063184 -0.3056551 0.0704468 -0.0595386 0.0787205 -0.1544592 -0.1224553 -0.0788959 -0.1161764 0.1537899 -0.2126739 -0.0168881 0.0506064 -0.078916 -0.3450008 0.4010299 0.1925321 0.3508904 -1.1611582 -0.7839616 -0.1069036 0.6989117 -0.0906159 -0.229198 0.085373 0.6639161 0.0983623 -0.9901 2.2993906 0.122839 -0.6115065 -0.0089232 1.7785152 0.2722545 -0.3081312 0.1650293 1.7659955 -0.6085145 0.0590206 0.3353628 0.1761081 -0.0832902 -0.0138961 0.0661146 0.0819081 -0.2703415 0.722471 0.1580738 -0.8456795 0.1388267 0.1403742 -0.1407364 -0.8015211 -0.1570733 1.1407829 -1.1404343 -0.3796406 0.238783 -0.4301627 -0.7211668 0.0459757 -0.0253843 -0.034061 -0.4698216 -0.6693026 0.13945 0.3014279 0.3302862 -0.8780153 -0.4858165 0.2397912 -0.2915328 -0.7842541 -0.0345143 -0.1161845 0.0389359 -0.1137523 0.0012083 0.0603345 -0.0072855 0.0059746 -0.0020218 unknown
polarizability: 89.6333814|-4.8867981|64.7053358|-14.8872615|-12.5232236|98.4893973 unknown
InChI: InChI=1/C4H6BF2N2.H/c1-4-2-8-9(3-4)5(6)7;/h2-3,5H,1H3;
charge 0 multiplicity 1
16 atoms
C  1.51930787 5.88800579 -0.82837488
H  2.37506748 5.37909816 -0.38157764
H  1.24466208 6.71884275 -0.17383528
C  1.01561214 7.05611331 -3.10629836
C  3.04969577 6.24055924 -2.88691055
H  -0.01113622 7.36737246 -2.98664941
H  3.97898221 5.78113135 -2.58775034
C  1.85025471 6.36920845 -2.20627139
N  1.67192869 7.31283651 -4.23087624
N  2.91059152 6.81526255 -4.09506616
B  3.76276962 7.05557147 -5.33752296
H  2.75484527 7.75905498 -6.13662918
H  2.07777965 7.73723228 -5.53679956
F  4.76778935 7.95730499 -5.20816683
F  4.06376718 5.95963291 -6.07786247
H  0.68264851 5.18530948 -0.8443823
