program: Gaussian 16
title: f_quinoline
version: ES64L-G16RevC.02
method: RwB97XD
basis: GenECP
operation: Freq
keyword: #N
keyword: Geom=AllCheck
keyword: Guess=TCheck
keyword: SCRF=Check
keyword: GenChk
keyword: RwB97XD/GenECP
keyword: Freq
converged: YES YES YES YES
title: Mulliken charges:
elementType: C C C C C C H C H H C C H H H N B H H F F
charge: 0.304589 -0.922830 -0.835987 0.248509 -0.166409 -0.377553 0.245312 0.598223 0.213645 0.231067 -0.718501 -0.028925 0.263445 0.249953 0.261770 0.128077 0.303261 0.312822 -0.048524 -0.131000 -0.130945
chargesum: 0.00000
title: Mulliken charges with hydrogens summed into heavy atoms:
elementType: C C C C C C C C C N B F F
charge: 0.549901 -0.922830 -0.835987 0.248509 0.047236 -0.146485 0.861668 -0.468548 0.232845 0.440898 0.254737 -0.131000 -0.130945
1716.lowfreq: -915.9851 -38.5479 -5.2383 -0.0006 -0.0002 0.0006 9.0027 23.2061 101.8197
frequency: -915.9838 -29.0703 101.7310 171.4777 187.4344 223.0962 268.9374 316.7417 426.2159 439.0043 471.2942 520.3528 525.3979 565.3411 578.1689 655.3539 675.5378 739.7990 773.4536 791.7410 816.5597 829.3565 854.1072 870.7814 957.3223 970.1794 987.5243 1016.1278 1022.4085 1060.2167 1093.6301 1111.7669 1116.1759 1165.7275 1194.1765 1212.8983 1224.2311 1249.3101 1284.5391 1301.4693 1366.1358 1414.3094 1442.3132 1467.4812 1513.1950 1557.5085 1661.6777 1665.5091 1689.3963 1775.1547 2269.5332 3186.9956 3195.6202 3195.7262 3202.5287 3212.5194 3231.0612
redmass: 1.1798 7.5973 7.6357 4.1655 4.8161 7.6277 10.9715 4.9131 4.8080 3.9141 3.1851 10.0409 6.9045 8.1910 3.9795 3.2787 7.3329 4.6789 1.1570 1.2634 2.4348 5.6082 2.0830 5.1692 1.3722 6.1941 1.3993 1.3386 1.3462 2.8247 2.0397 9.4649 3.8131 1.3177 1.4187 1.0949 1.3515 1.7724 1.6015 1.8303 2.7237 2.5104 4.6842 2.0609 2.7657 3.9338 5.3287 7.2175 6.6592 1.0633 1.0465 1.0881 1.0908 1.0907 1.0926 1.0979 1.0973
irintensity: 3079.0580 0.8567 0.2866 4.7392 0.3239 8.3466 25.6594 3.0819 10.9984 3.2173 1.3025 9.4621 5.4586 3.6023 2.6657 1.2875 87.4985 101.6914 1.1773 15.7851 49.5715 5.4407 65.2268 36.2005 2.8519 182.1423 0.2609 0.1548 1.7397 4.6960 1.1510 350.3628 79.6413 12.8333 47.9533 20.1182 14.7797 8.7015 23.0836 80.6699 12.6118 22.6266 31.2800 11.6520 2.0577 40.0611 18.6598 93.3819 57.0513 152.2805 1850.6118 2.9972 12.1232 0.4486 8.0645 20.1126 5.4572
temp: 298.150 k
press: 1.00000 atm
elementType: 6 6 6 6 6 6 1 6 1 1 6 6 1 1 1 7 5 1 1 9 9
symmnumber: 1
zpe: 399649.9 jmol-1
zpe.correction: 0.152219 hartree
zpe.thermalcorrener: 0.161159 hartree
zpe.thermalcorrenthalpy: 0.162103 hartree
zpe.thermalcorrgfe: 0.117734 hartree
zpe.sumelectzpe: -626.957719 hartree
zpe.sumelectthermal: -626.948779 hartree
zpe.sumelectthermalent: -626.947835 hartree
zpe.sumelectthermalfe: -626.992204 hartree
dipole: 0.4236 8.3658 -0.1520
dipole: 8.3779
quadrupole: -60.5291 -63.7624 -82.2454
quadrupole: -13.2579 1.0600 -0.7069
quadrupole: 8.3165 5.0833 -13.3997 -13.2579 1.0600 -0.7069
hfenergy: -627.1099376 hartree
pointgroup: C01 [X(C9H8B1F2N1)]
dipole: 0.1666463 3.2913743 -0.0598149 debye
dipolederiv: -0.0544475 0.0607345 -0.0015576 0.1156139 0.2134018 -0.0077564 -0.0022658 -0.0102047 -0.1087624 -0.4419212 0.1143358 -0.0134208 -0.0546329 -0.369492 0.000994 -0.0117172 0.0130256 -0.2148228 0.0839347 -0.1155118 0.0054366 0.4338702 0.2661528 0.007917 -0.0123251 -0.0082905 0.1243749 0.0649453 0.192679 -0.0067636 -0.3286487 -0.4773375 0.0080823 0.0101617 0.0213498 0.0408993 0.0587186 -0.0543043 0.0077029 -0.0671355 0.0274935 -0.0089833 0.0066885 -0.0086939 -0.1590572 0.1353771 -0.0642093 0.0086013 -0.1156891 -0.1119388 -0.0036022 0.0109198 -0.0020432 -0.1334224 0.0486531 -0.0648184 0.0004651 -0.0881446 -0.0503322 0.0037958 0.0001721 0.0028873 0.1378054 0.4995733 0.0161112 0.0151192 0.1715178 0.3189592 -0.0087056 0.00962 -0.0129777 -0.0737435 0.0324433 0.0452938 -0.0049462 0.0969686 -0.0449466 0.0098594 -0.00699 0.0082755 0.1570833 -0.1077956 -0.0075658 -0.006363 -0.0051006 0.0876304 0.0022802 -0.0063344 0.0021907 0.1556026 -0.6111371 0.0636057 -0.0143961 0.3182977 -0.0681781 0.0057809 -0.0250381 -0.003666 -0.1657251 0.3771994 0.1325291 0.0030551 -0.4782892 0.4143335 -0.0244127 0.0249518 -0.0075098 0.0448907 0.0557205 0.0915029 -0.0055546 0.0407212 -0.0123768 0.0063494 -0.0031969 0.0085326 0.1408308 0.0498944 -0.0605614 -0.0011728 -0.0727302 -0.0260865 0.0050161 -0.0000585 0.0050091 0.1682362 -0.059057 -0.0309798 -0.0042892 0.0149522 0.0829701 0.002352 -0.0058345 0.0023445 0.1370947 -0.2489887 -0.0112083 0.0010478 0.1561618 -1.4723898 0.0597977 -0.003932 0.0607932 -0.1945241 1.3298942 0.2864199 -0.0406749 -0.103301 2.0976007 -0.0131224 -0.0207762 0.0428162 1.6841158 0.0373536 -0.0537103 -0.008849 -0.1033916 2.0643206 -0.0942357 -0.0039565 -0.1230895 0.106519 -0.3330283 -0.3663908 -0.0076222 -0.0599111 -0.7941607 0.0241317 -0.0184886 0.0208659 -0.0260326 -0.4577725 -0.0362746 0.0106289 0.0898528 -1.0692467 -0.3593621 0.0083211 -0.5920214 -0.906014 -0.4595596 -0.1376768 0.0635531 0.0390183 -1.0763771 0.3838239 0.0500789 0.5804063 -0.9153487 unknown
polarizability: 181.1150541|20.480577|179.8620046|2.0755609|-3.1880312|76.5934289 unknown
InChI: InChI=1/C9H7BF2N.H/c11-10(12)8-5-1-3-7-4-2-6-13-9(7)8;/h1-6,10H;
charge 0 multiplicity 1
21 atoms
C  -4.0614328 -0.05667847 -0.05883867
C  -2.68743053 -0.02627651 -0.02662457
C  -2.0772994 1.25780187 -0.05383797
C  -2.82668034 2.45490104 -0.11324554
C  -4.23881288 2.36019209 -0.14675075
C  -4.83495827 1.1276607 -0.11931717
H  -4.57688486 -1.01151248 -0.03810421
C  -2.10617634 3.67131609 -0.13576973
H  -4.8318239 3.26700911 -0.1937115
H  -5.91614533 1.05203746 -0.14415007
C  -0.73508886 3.66094152 -0.09913165
C  -0.06275402 2.42569444 -0.03791581
H  -2.64865249 4.60999609 -0.1819644
H  -0.16281876 4.57919087 -0.11529414
H  1.02014945 2.37414448 -0.00504637
N  -0.715903 1.289575 -0.017437
B  -1.773462 -1.349811 0.034537
H  -0.459815 -0.110256 0.058816
H  -0.433816 -1.019238 0.135108
F  -1.76745466 -2.11142474 -1.12338383
F  -1.92457249 -2.11387001 1.18045203
