program: Gaussian 16
title: h_benzopiperidine
version: ES64L-G16RevC.02
method: RwB97XD
basis: GenECP
operation: Freq
keyword: #N
keyword: Geom=AllCheck
keyword: Guess=TCheck
keyword: SCRF=Check
keyword: GenChk
keyword: RwB97XD/GenECP
keyword: Freq
converged: YES YES YES YES
title: Mulliken charges:
elementType: H C C C C H C H H B H H C N C C C H H C H H C H H H H H H H H
charge: 0.208083 -0.441991 -0.259742 -0.312749 0.305392 0.244669 -0.097155 0.231255 0.176685 -0.325761 0.017966 0.163338 -0.166079 0.131387 -0.092070 -0.347780 -0.517939 0.224925 0.164433 -0.380011 0.190897 0.204947 -0.412958 0.209762 0.179332 0.211975 0.171700 0.210188 0.144881 -0.016839 -0.020742
chargesum: -0.00000
title: Mulliken charges with hydrogens summed into heavy atoms:
elementType: C C C C C B C N C C C C C
charge: -0.233908 -0.015073 -0.081494 0.305392 0.079530 -0.345376 -0.166079 0.294725 0.297289 0.048064 -0.128844 0.003664 -0.057889
1716.lowfreq: -606.6927 -17.7359 0.0003 0.0004 0.0007 10.7375 18.4481 63.0359 91.0631
frequency: -606.6392 62.7816 91.0432 106.1443 186.3743 240.8089 256.7188 269.5931 312.3603 324.3517 383.2122 431.8109 464.0883 468.9155 497.4945 518.5996 569.4181 577.6543 644.9930 727.1884 729.3279 759.9432 789.3714 819.3373 829.1266 859.5802 864.2821 884.8969 903.6907 909.4162 935.7413 955.9730 980.5550 986.5097 1017.9222 1046.6938 1064.6741 1070.5704 1085.6545 1089.8186 1119.4258 1137.1062 1163.3941 1175.5417 1179.9264 1188.3493 1204.5715 1230.8983 1255.1855 1272.8386 1297.2541 1306.0308 1314.9823 1326.4223 1359.3752 1364.2370 1394.5866 1396.4418 1398.4649 1428.0523 1441.0444 1484.9357 1488.4638 1489.9557 1498.1218 1499.0342 1514.7391 1520.5990 1638.8547 1672.1172 2493.2234 2557.1947 2628.6696 2995.7400 2999.9404 3032.8536 3048.2717 3048.8083 3097.5983 3102.1159 3105.7330 3110.0508 3121.7508 3176.3970 3187.8776 3197.7724 3210.3620
redmass: 1.2009 3.0632 3.4210 3.3142 2.6688 2.1839 1.9058 3.5174 1.4524 3.1696 1.7714 2.4099 2.6929 2.7592 2.7800 1.7757 3.2723 3.6744 3.7771 1.6456 1.7497 2.3344 1.7092 2.3718 1.5260 2.8126 1.5999 1.3723 1.2382 1.6095 2.1300 2.6115 1.3805 1.3588 1.3165 2.6401 1.8592 1.7476 1.3538 1.4741 2.0585 1.6520 1.4211 1.8011 1.4129 1.1375 1.5045 1.4497 2.2320 1.9389 1.2413 1.4602 1.5675 2.7418 1.3593 1.4744 1.4963 1.4595 1.4065 1.4746 1.0830 1.0945 2.3299 1.0919 1.0976 1.0963 1.1722 2.2679 6.0613 6.2228 1.0578 1.1194 1.0192 1.0715 1.0698 1.0680 1.0634 1.0630 1.0950 1.1007 1.1022 1.0957 1.0936 1.0868 1.0887 1.0935 1.0986
irintensity: 1687.7347 0.7804 0.5305 1.5934 0.6053 12.8983 1.9675 2.5224 2.5741 3.0461 7.9141 32.1832 5.1881 5.4696 38.8258 21.7276 13.8631 32.1519 9.8657 93.5275 23.6663 48.9895 34.2568 21.8364 1.5601 0.3040 6.0711 10.7369 25.0434 7.4682 2.9045 7.9084 0.0462 2.3029 0.0376 18.1484 13.4500 15.3009 0.6230 2.5595 9.9345 12.6106 4.0731 17.6507 0.3999 0.2396 3.3323 23.9897 38.6147 14.6123 1.9583 8.7782 12.1940 9.1954 7.7604 18.0631 0.9689 3.4664 6.8028 1.9053 81.9002 3.7571 27.5380 14.4383 15.6370 12.2123 17.4962 27.0627 9.1095 9.5693 342.6212 207.7038 1433.3046 23.2341 37.6134 33.1523 23.2845 34.5489 60.1718 43.8896 41.9040 28.8208 13.9995 6.7423 4.4030 35.0088 22.8384
temp: 298.150 k
press: 1.00000 atm
elementType: 1 6 6 6 6 1 6 1 1 5 1 1 6 7 6 6 6 1 1 6 1 1 6 1 1 1 1 1 1 1 1
symmnumber: 1
zpe: 703356.0 jmol-1
zpe.correction: 0.267894 hartree
zpe.thermalcorrener: 0.279315 hartree
zpe.thermalcorrenthalpy: 0.280259 hartree
zpe.thermalcorrgfe: 0.231034 hartree
zpe.sumelectzpe: -509.265179 hartree
zpe.sumelectthermal: -509.253758 hartree
zpe.sumelectthermalent: -509.252814 hartree
zpe.sumelectthermalfe: -509.302039 hartree
dipole: 3.6986 -2.8816 -0.0869
dipole: 4.6895
quadrupole: -74.8022 -83.7425 -83.3801
quadrupole: 2.1650 1.2085 -0.4451
quadrupole: 5.8394 -3.1009 -2.7385 2.1650 1.2085 -0.4451
hfenergy: -509.5330729 hartree
pointgroup: C01 [X(C11H18B1N1)]
dipole: 1.4551559 -1.133727 -0.0341981 debye
polarizability: 208.1204379|2.5842838|187.0643921|1.5708175|5.7132743|128.7745963 unknown
InChI: InChI=1/C11H16BN.2H/c12-10-6-2-3-7-11(10)13-8-4-1-5-9-13;;/h2-3,6-7H,1,4-5,8-9,12H2;;
charge 0 multiplicity 1
31 atoms
H  -4.32858349 -1.61574763 -0.27928933
C  -3.27492806 -1.36937838 -0.20397924
C  -2.88140184 -0.04644299 -0.03621205
C  -2.32022129 -2.37922235 -0.26171046
C  -1.53267859 0.30919042 0.06091607
H  -3.63920914 0.72828176 0.02778223
C  -0.97217745 -2.059437 -0.15668886
H  -2.62265849 -3.41294964 -0.38675462
H  -0.22497682 -2.84430044 -0.19961581
B  -1.04867483 1.81344839 0.24475353
H  0.21775517 1.78050901 1.10429085
H  0.45310863 1.03906352 0.71336518
C  -0.5927255 -0.7296688 -0.00648087
N  0.78593988 -0.32802607 0.11043307
C  1.62115742 -1.16314862 0.98339882
C  1.4211508 -0.0750708 -1.19691812
C  2.96414586 -0.48504969 1.23121374
H  1.07864703 -1.31564519 1.91876968
H  1.78848576 -2.15032554 0.52734889
C  2.76449688 0.61905751 -1.01181017
H  0.73957248 0.54452221 -1.78200233
H  1.54974797 -1.03018087 -1.7288034
C  3.67600572 -0.18755955 -0.0879783
H  3.57638482 -1.12980512 1.86718453
H  2.79800043 0.44829324 1.78079969
H  3.22905891 0.76210534 -1.99089918
H  2.59364676 1.61493512 -0.58745751
H  4.60926433 0.35124206 0.09466056
H  3.94290105 -1.13328032 -0.57633421
H  -1.67841749 2.50063669 1.00531685
H  -0.60823902 2.37044289 -0.73047796
