program: Gaussian 16
title: h_biphenylene
version: ES64L-G16RevC.02
method: RwB97XD
basis: GenECP
operation: Freq
keyword: #N
keyword: Geom=AllCheck
keyword: Guess=TCheck
keyword: SCRF=Check
keyword: GenChk
keyword: RwB97XD/GenECP
keyword: Freq
converged: YES YES NO YES
title: Mulliken charges:
elementType: C C C C C C C H C H H C H C H C C H B N C H H H C H H H H H H H
charge: 0.370039 -0.005919 -0.334953 0.209869 -0.425524 -0.214176 -0.171493 0.208996 -0.480621 0.238181 0.196124 -0.506884 0.212534 -0.427215 0.220907 -0.086804 0.478310 0.243880 -0.572834 0.116434 -0.413679 0.187780 0.206434 0.221582 -0.370585 0.192589 0.172217 0.225068 0.311344 0.005099 0.024761 -0.031461
chargesum: -0.00000
title: Mulliken charges with hydrogens summed into heavy atoms:
elementType: C C C C C C C C C C C C B N C C
charge: 0.370039 -0.005919 -0.334953 0.209869 -0.216528 -0.214176 0.066688 -0.284497 -0.294350 -0.206308 0.157076 0.478310 -0.574435 0.427778 0.202117 0.219289
1716.lowfreq: -853.1581 -15.4114 -0.0005 -0.0005 0.0003 3.5222 8.5077 40.5117 81.3060
frequency: -853.1497 39.3389 81.2702 112.6281 138.5061 149.3544 201.3584 209.1372 215.3799 240.1632 286.1876 293.6536 332.9363 354.9972 386.3172 454.8038 463.2503 475.1565 512.8141 559.2571 576.9766 606.0983 625.9427 639.7933 654.1246 729.9277 745.9678 759.8952 780.4877 785.4534 804.1931 826.6845 880.4152 906.9244 928.3484 940.4900 969.2587 993.7303 996.8069 1003.3195 1008.6122 1046.8464 1063.7016 1065.5045 1099.3219 1138.4016 1152.6050 1170.3058 1180.2511 1184.0934 1190.9007 1198.8122 1212.1643 1232.3251 1249.2360 1257.7623 1280.4089 1308.6858 1353.7916 1411.5534 1440.4276 1446.7306 1475.0234 1483.0940 1493.4919 1496.3240 1498.8617 1502.8773 1519.1389 1519.5822 1579.0255 1655.5456 1667.5063 1697.1768 1765.8407 2314.3673 2487.5972 2529.5123 3032.7287 3042.1627 3120.5495 3120.7377 3153.8996 3160.5804 3172.9701 3189.2059 3192.0234 3204.0922 3211.2237 3216.2454
redmass: 1.0958 2.9566 4.9675 2.8483 3.1016 3.2774 2.6039 1.9421 1.0841 1.4090 2.3524 3.4388 3.0536 4.2062 3.9689 2.9927 4.1820 3.3477 2.8864 3.2071 2.8583 4.9276 2.3149 3.3928 5.1188 2.5911 3.9715 1.6569 1.6278 1.4494 3.0753 3.6424 2.0940 3.1070 1.3822 1.4239 2.4460 1.3243 1.4783 1.3485 4.9188 2.3163 1.6330 1.8323 1.2278 1.3283 1.8200 2.2178 1.6642 1.2779 1.7209 1.5364 2.1186 1.8072 2.1872 2.5030 1.3341 2.5273 2.1125 2.3510 2.6135 1.1676 1.1970 1.0449 1.1300 1.9673 1.6028 1.1783 1.2389 6.3155 1.0688 7.5281 7.7105 9.0510 9.7905 1.0277 1.0582 1.1152 1.0393 1.0366 1.0979 1.1012 1.1048 1.1044 1.0871 1.0869 1.0925 1.0932 1.0957 1.0963
irintensity: 3001.7184 1.8308 4.6025 1.5481 5.9712 0.2799 1.1333 2.2158 0.1816 0.0259 1.3198 0.8957 2.4120 0.9628 2.2593 10.6060 0.0763 1.1495 26.9724 2.6126 12.6348 2.3618 3.5597 14.7360 0.0253 12.9840 8.9726 45.7215 9.8690 86.3271 4.8481 4.1682 6.5655 9.4389 4.8681 1.2753 109.7237 0.3979 32.3067 0.2144 20.0725 9.2438 10.6065 2.2532 15.4016 10.7387 24.3105 1.2882 24.5778 12.6270 37.4803 16.8240 2.2539 9.0765 11.2666 14.5040 7.7307 18.1877 11.9792 5.6472 35.3303 3.3653 0.6017 2.2704 11.9200 5.0629 6.4025 34.9868 38.4739 0.3205 108.1754 0.9020 1.9775 10.0119 13.4561 1891.8233 214.1036 184.3274 30.7790 38.3791 20.6866 14.0757 11.7656 13.9508 8.3729 2.7196 29.9721 12.9597 27.3690 19.1775
temp: 298.150 k
press: 1.00000 atm
elementType: 6 6 6 6 6 6 6 1 6 1 1 6 1 6 1 6 6 1 5 7 6 1 1 1 6 1 1 1 1 1 1 1
symmnumber: 1
zpe: 681005.2 jmol-1
zpe.correction: 0.259381 hartree
zpe.thermalcorrener: 0.273233 hartree
zpe.thermalcorrenthalpy: 0.274177 hartree
zpe.thermalcorrgfe: 0.219321 hartree
zpe.sumelectzpe: -622.281868 hartree
zpe.sumelectthermal: -622.268017 hartree
zpe.sumelectthermalent: -622.267073 hartree
zpe.sumelectthermalfe: -622.321928 hartree
dipole: -5.8192 -0.5238 -0.3344
dipole: 5.8523
quadrupole: -87.7119 -87.5411 -100.3387
quadrupole: 11.0402 1.4236 1.9863
quadrupole: 4.1520 4.3228 -8.4748 11.0402 1.4236 1.9863
hfenergy: -622.5412493 hartree
pointgroup: C01 [X(C14H16B1N1)]
dipole: -2.2894478 -0.2060636 -0.1315534 debye
polarizability: 313.1440429|4.9061824|239.5236559|5.2007371|9.086136|129.2989164 unknown
InChI: InChI=1/C14H15BN.H/c1-16(2)12-8-4-6-10-9-5-3-7-11(15)13(9)14(10)12;/h3-8H,1-2,15H3;
charge 0 multiplicity 1
32 atoms
C  0.76243422 0.70516832 0.11307842
C  0.73707509 2.10968897 0.23419917
C  -0.78899531 2.07055899 0.17502988
C  -0.71719138 0.66443008 0.04880187
C  -1.99705065 2.70824011 0.19818892
C  -1.79634863 -0.14979987 -0.05574751
C  -3.14216947 1.87044833 0.08976538
H  -2.11021725 3.78147555 0.29247647
C  -3.05933979 0.49440147 -0.02905274
H  -4.12414955 2.33011433 0.10188951
H  -3.97218361 -0.08645572 -0.10431353
C  1.90465899 2.8159978 0.34362077
H  1.95897125 3.8938366 0.43991
C  3.08223649 2.02544936 0.31957163
H  4.04148711 2.52668555 0.39750107
C  3.06541125 0.64099412 0.19587286
C  1.86057578 -0.10744142 0.0859008
H  4.01624337 0.11636754 0.18085455
B  1.70499371 -1.69569296 -0.01054994
N  -1.57764419 -1.57719077 -0.15669069
C  -1.81890792 -2.27220468 1.11626764
H  -2.87897449 -2.24342358 1.39256753
H  -1.49941085 -3.31137083 1.01605992
H  -1.2263661 -1.79574017 1.89685027
C  -2.2868823 -2.20370245 -1.27767893
H  -1.93730886 -3.23306747 -1.3806613
H  -3.3709171 -2.21320873 -1.12342182
H  -2.05815934 -1.65831707 -2.19378911
H  -0.14394169 -1.76385989 -0.47524416
H  0.62245595 -1.92601969 -0.91454956
H  1.39229089 -2.24727295 1.01933277
H  2.51668137 -2.29834486 -0.66948211
