program: Gaussian 16
title: Me_H-TS1
version: ES64L-G16RevC.01
method: RwB97XD
basis: GenECP
operation: Freq
keyword: #N
keyword: Geom=AllCheck
keyword: Guess=TCheck
keyword: SCRF=Check
keyword: GenChk
keyword: RwB97XD/GenECP
keyword: Freq
converged: YES YES YES YES
title: Mulliken charges:
elementType: C C H C N N B H H H H H H H C C H H H
charge: -0.392931 -0.014923 0.241120 -0.152470 0.035865 -0.002830 -0.139941 0.272880 -0.071370 0.179158 0.178688 0.226099 -0.057044 -0.057546 -0.090820 -0.736381 0.189559 0.200631 0.192256
chargesum: 0.00000
title: Mulliken charges with hydrogens summed into heavy atoms:
elementType: C C C N N B C C
charge: 0.191014 0.226198 -0.152470 0.035865 0.270050 -0.325901 -0.090820 -0.153936
1716.lowfreq: -1143.7131 -13.9510 -2.9306 -0.0010 -0.0009 -0.0009 15.1117 86.2433 118.6719
frequency: -1143.7130 86.0528 118.6548 144.6197 199.9337 257.1852 275.8932 280.9451 314.6265 531.2687 616.2764 627.0210 661.8992 678.8791 759.5752 816.8628 888.0660 954.9409 963.1232 1024.7387 1035.3182 1064.8368 1074.4576 1104.1862 1149.7434 1164.4682 1192.1597 1202.1738 1262.5912 1291.0359 1392.9255 1416.9710 1459.8865 1472.7187 1480.2908 1494.3711 1507.5081 1548.3918 1560.3529 1629.8341 1799.6345 2026.5009 2483.2235 2529.9593 3052.0138 3062.3514 3115.2706 3139.9829 3165.6847 3170.2082 3282.1900
redmass: 1.0840 1.0517 1.0978 2.2751 1.7618 1.4597 2.7146 2.9835 2.7478 2.8491 4.2689 3.0159 4.1108 4.0046 1.2944 3.1508 1.8461 1.3750 1.0431 6.0840 1.6306 1.4914 1.7054 1.0388 1.3265 1.1631 1.7726 1.3570 1.8423 4.4085 4.5368 1.2682 1.4163 1.1394 1.0439 1.0415 1.1799 2.7416 4.4155 5.6865 1.0762 1.0651 1.0554 1.1197 1.0387 1.0354 1.1016 1.1041 1.1004 1.1043 1.0996
irintensity: 3562.5155 0.0803 0.0971 1.6125 0.9267 9.9042 1.7642 1.3592 8.6692 4.7683 9.1692 2.4790 14.0711 9.0974 39.9545 14.0353 1.9468 60.4959 1.6676 47.1778 30.9754 3.3879 14.9639 8.8071 2.3192 49.7618 19.9557 20.0374 96.1914 31.4428 21.2635 1.5143 39.7730 39.9197 6.9479 21.1352 1.9557 78.1254 86.5870 11.2852 144.1529 940.8178 181.0321 233.7483 22.5619 38.7532 12.4509 11.8814 6.0217 7.0431 0.1404
temp: 298.150 k
press: 1.00000 atm
elementType: 6 6 1 6 7 7 5 1 1 1 1 1 1 1 6 6 1 1 1
symmnumber: 1
zpe: 403929.9 jmol-1
zpe.correction: 0.153849 hartree
zpe.thermalcorrener: 0.162485 hartree
zpe.thermalcorrenthalpy: 0.163430 hartree
zpe.thermalcorrgfe: 0.120830 hartree
zpe.sumelectzpe: -331.272170 hartree
zpe.sumelectthermal: -331.263534 hartree
zpe.sumelectthermalent: -331.262589 hartree
zpe.sumelectthermalfe: -331.305189 hartree
dipole: 5.9874 4.3894 -1.9478
dipole: 7.6753
quadrupole: -60.4210 -57.5950 -53.4760
quadrupole: -13.1247 5.3901 0.5596
quadrupole: -3.2570 -0.4310 3.6880 -13.1247 5.3901 0.5596
hfenergy: -331.426019 hartree
pointgroup: C01 [X(C5H11B1N2)]
dipole: 2.355632 1.7269283 -0.7663232 debye
dipolederiv: 0.6557681 0.1408692 -0.0003108 0.1182254 0.2317945 0.0262297 -0.0446269 0.0280565 0.2343706 0.0822316 -0.0719494 0.0508355 0.2734391 -0.0273841 -0.070893 -0.1552759 -0.081228 -0.1580672 0.0214789 0.0455715 -0.0300447 0.0303571 0.0786573 0.068307 -0.0194104 0.0660775 0.1705355 -0.0723959 0.1152137 -0.0631699 -0.1135986 -0.2092692 0.0290154 0.0633428 0.031533 -0.1797762 -1.0097261 -0.2046542 0.0430813 -0.2237655 -0.1570813 -0.0056456 0.1540452 0.0020251 -0.1395938 -1.33574 -0.653329 0.2804031 -0.3969399 -0.7737107 0.2209849 0.1547478 0.2222425 -0.3807984 0.4098965 -0.15417 0.0749599 -0.0092033 0.6999891 -0.1006359 0.0021899 -0.1090837 0.5634999 1.1363368 0.9359258 -0.4325609 0.8100114 0.8369627 -0.3319767 -0.3718056 -0.3268404 0.2688921 -0.2704455 -0.0405444 0.0077385 -0.2228759 -0.5955708 0.298703 0.1027538 0.3081514 -0.1486394 0.0004491 -0.0051106 0.0020804 0.1061165 -0.0418241 0.0254652 -0.0263938 0.0259411 0.1045034 0.0015252 -0.0253897 -0.0263046 -0.0754665 0.0632065 0.0573778 0.062708 0.0702279 -0.0665789 -0.0568463 -0.0251209 0.0185554 -0.1037134 -0.0126708 -0.0847299 -0.0481712 -0.1005052 -0.0061435 -0.1926489 -0.012343 0.0635063 -0.0524718 -0.1716015 0.0264602 0.1746741 0.1011858 -0.4161929 -0.1781524 -0.0411822 -0.0240246 -0.1592104 -0.4011702 -0.071943 -0.0532161 -0.1379707 -0.2003677 0.726393 0.0765215 -0.0063008 0.0338228 0.4745963 -0.1719465 -0.0020984 -0.188165 0.234244 0.0294565 -0.0672868 0.0312717 0.0137164 0.0101643 0.0559469 -0.0116526 0.0633255 0.0854731 0.0506492 -0.0834116 -0.0516305 -0.060117 -0.0648417 0.0122613 -0.0661602 -0.0540274 -0.0016614 0.0445059 -0.0108955 0.1051295 0.0188724 -0.0049175 -0.0059765 0.0911794 0.056762 -0.061375 -0.0427355 0.0812857 -0.0432147 0.0128012 0.0646713 0.0229956 -0.0068301 0.0222921 0.0976757 unknown
polarizability: 120.183159|15.4877856|110.4837319|-5.0749307|-18.9415408|81.849532 unknown
InChI: InChI=1/C5H10BN2.H/c1-4-7-5(6)3-8(4)2;/h3H,1-2,6H3;
charge 0 multiplicity 1
19 atoms
C  1.58665602 -0.02163678 -0.05548715
C  -0.30636399 -1.56249965 0.61048313
H  0.36105279 -2.30216078 1.0208014
C  -1.66412755 -1.50553056 0.52036569
N  0.18877686 -0.40313129 0.02774235
N  -1.97459811 -0.31093747 -0.11096912
B  -3.02582603 -2.27301088 0.85030206
H  -3.29478006 -0.70749011 0.03002771
H  -3.92669653 -1.34780827 0.33213543
H  2.20103886 -0.90781231 0.09408397
H  1.80579041 0.39142792 -1.04067189
H  1.83455797 0.71756926 0.70931664
H  -3.37377291 -2.32053823 2.00525877
H  -3.28792948 -3.25104409 0.1930799
C  -0.85780563 0.3365793 -0.39630158
C  -0.74013395 1.65656158 -1.06990727
H  -0.20577796 2.37578599 -0.4435
H  -0.20408828 1.57140494 -2.01931254
H  -1.73772733 2.04414821 -1.27066981
