program: Gaussian 09
title: 000075791
version: EM64L-G09RevD.01
frameworkgroup: C1[X(C9H8O4)]
method: RPBEPBE
basis: SDD
operation: Freq
keyword: #p
keyword: freq=noraman
keyword: PBEPBE/SDD
title: #p freq=noraman PBEPBE/SDD
converged: YES YES NO NO
title: Mulliken charges:
elementType: O O O O C C C C C C C C C H H H H H H H H
charge: -0.409540 -0.401260 -0.193250 -0.215565 -0.406686 0.473711 -0.333720 -0.422161 0.167885 0.193235 -0.233117 -0.222554 -0.237482 0.289736 0.260032 0.233215 0.229230 0.229091 0.230894 0.384997 0.383310
chargesum: 0.00000
title: Mulliken charges with hydrogens summed into heavy atoms:
elementType: O O O O C C C C C C C C C
charge: -0.024543 -0.017950 -0.193250 -0.215565 -0.116950 0.473711 -0.073688 -0.188946 0.167885 0.193235 -0.003887 0.006537 -0.006588
polarizability: 1.33144777e+02 -2.96818189e+00 8.03409693e+01 3.04041436e-01 -1.39720178e+01 9.70522227e+01
1716.lowfreq: -10.0620 -7.1382 -5.6150 0.0010 0.0011 0.0014 30.5281 36.1949 48.6665
frequency: 30.4854 36.1420 48.6578 85.8772 127.0537 143.0160 241.2717 304.0431 315.0030 370.3623 402.6074 485.9452 508.7963 532.1482 598.8573 609.8445 618.0759 640.3871 684.3126 700.0978 710.7203 765.6162 842.3811 849.1939 901.4441 904.4564 946.5239 974.7930 991.0589 997.2984 1027.7366 1040.7577 1054.5850 1085.8871 1174.1067 1189.3678 1193.7856 1222.4765 1243.9381 1302.8812 1325.1649 1341.0875 1386.2057 1444.1066 1483.8793 1596.2849 1612.5747 1657.8160 1683.7051 3059.6812 3122.5989 3131.8267 3144.7690 3157.1814 3169.2725 3511.3098 3520.0884
redmass: 9.4316 4.5515 8.7918 6.4450 6.6403 6.2108 4.7879 6.1565 7.4066 8.0791 2.7975 3.4552 2.8287 3.0476 2.4062 2.1156 2.7409 2.2811 4.4006 2.0372 3.1713 2.0284 5.1728 1.2569 5.6209 1.9073 2.6713 1.3961 6.2375 1.3269 2.2888 2.3745 2.4715 1.6238 1.0620 1.5913 1.1582 1.4267 1.8925 2.0696 1.9473 1.3563 7.6184 2.1668 2.2747 6.1327 6.0362 8.5795 9.7321 1.0835 1.0866 1.0878 1.0925 1.0963 1.1010 1.0640 1.0642
irintensity: 1.1587 0.2177 2.0414 1.0303 0.7830 1.8439 0.9934 0.6826 7.0992 2.0934 0.1354 4.5092 15.1434 7.9935 136.1872 86.5652 84.9754 82.2992 25.3098 39.5682 37.9042 28.9937 13.9382 0.2582 17.1567 1.2426 4.6522 0.0233 3.1488 0.4086 7.7086 231.4500 319.9979 27.3012 0.4689 8.5485 0.2559 7.7500 1.8490 51.2651 92.7371 15.7916 1.9713 11.2726 16.8094 1.9417 3.9861 171.0766 231.6324 2.3389 4.0352 1.9918 25.1616 23.9821 11.5563 31.0245 32.6908
temp: 298.150 k
press: 1.00000 atm
elementType: 8 8 8 8 6 6 6 6 6 6 6 6 6 1 1 1 1 1 1 1 1
symmnumber: 1
zpe: 402241.6 jmol-1
zpe.correction: 0.153206 hartree
zpe.thermalcorrener: 0.165032 hartree
zpe.thermalcorrenthalpy: 0.165977 hartree
zpe.thermalcorrgfe: 0.113086 hartree
zpe.sumelectzpe: -647.723759 hartree
zpe.sumelectthermal: -647.711933 hartree
zpe.sumelectthermalent: -647.710989 hartree
zpe.sumelectthermalfe: -647.763879 hartree
dipole: 0.0244 1.4272 -1.5649
dipole: 2.1181
quadrupole: -62.8329 -73.1526 -74.1460
quadrupole: 1.9824 2.8574 0.9392
quadrupole: 7.2109 -3.1088 -4.1022 1.9824 2.8574 0.9392
hfenergy: -647.8769651 hartree
pointgroup: C01 [X(C9H8O4)]
dipole: -0.0317492 0.168149 0.815571 debye
dipolederiv: -1.2773572 0.133743 -0.2968307 0.2030243 -0.4083065 0.1281485 -0.2391077 0.0812024 -0.374393 -0.404124 -0.0272074 -0.1159135 -0.1035889 -0.5978401 -0.5087277 -0.1584428 -0.419027 -0.9174166 -0.6755833 0.1045659 -0.041903 -0.0196266 -0.5513572 -0.2969799 -0.2746887 -0.290861 -0.6201028 -0.4464223 -0.1353718 0.173247 -0.2744047 -0.6396622 0.1593613 0.164283 0.0118541 -0.78832 -0.1449935 -0.1243041 0.0331894 -0.036001 -0.3134816 -0.1398161 0.1524612 -0.1670848 -0.0083422 0.3209224 0.0518827 0.0053438 -0.0523884 -0.1215239 -0.0137399 0.0992329 -0.00315 -0.0222732 -0.0362118 -0.0095278 -0.0940786 -0.0458881 -0.0870138 0.0071622 -0.0893025 -0.0138154 -0.0246112 -0.0907891 -0.0121898 0.070815 -0.0050316 -0.1355162 -0.0377767 -0.0304768 -0.0568076 0.0531306 1.5174776 -0.3478293 0.3001061 -0.3097119 0.7697934 0.3927218 0.3726526 0.5256002 0.7800664 0.4275366 0.4150536 -0.097632 0.636046 1.2673985 0.2813799 -0.1029441 0.2615808 1.3607826 -0.0635533 -0.0060414 0.0904322 0.0065049 -0.1304591 -0.0473853 0.0787292 -0.0539681 0.1138627 -0.0063013 0.0157558 -0.1093635 0.0314793 -0.1296742 -0.0381503 -0.100384 -0.0396998 0.0232848 0.0990202 -0.0107927 0.0285943 -0.0070073 -0.1532327 -0.0272738 0.0288548 -0.0153923 -0.0400249 0.0811939 0.0176929 0.0154071 0.0170303 0.0717297 0.021211 -0.0384888 0.0344237 -0.0065917 0.0384313 -0.0164927 0.07586 -0.0279886 0.128474 0.0168821 0.080658 0.0243535 0.0456198 0.0574372 0.0216696 -0.0911517 0.0097926 0.1356636 0.0417046 -0.0668343 0.0484116 -0.0598865 0.0477986 0.0110015 -0.0567944 0.0162228 0.1440308 0.050944 -0.0750458 0.0517278 -0.0816774 -0.020335 -0.0246239 0.0951878 -0.0195107 0.1511226 0.0413806 0.1082974 0.0418709 -0.0240195 -0.1275965 0.0063584 -0.0393738 0.0034383 0.1538007 0.015149 -0.0415247 0.0153907 0.0870559 0.3330801 0.0242158 0.0117967 0.0514238 0.2611688 -0.1229051 0.0501887 -0.1476047 0.2209614 0.3703695 -0.0875583 0.0430618 -0.0738146 0.1848855 0.0767097 0.0818823 0.1109949 0.2828948 unknown
polarizability: 132.9690499|3.1881011|72.5012699|2.4720282|-0.5538301|105.067649 unknown
InChI: InChI=1S/C9H8O4/c10-8(11)7(9(12)13)6-4-2-1-3-5-6/h1-5,7,10,12H
charge 0 multiplicity 1
21 atoms
O  2.966717 -1.274021 0.159467
O  1.564387 1.953011 1.502412
O  1.260807 -1.797805 -1.328161
O  1.884011 1.74442 -0.791452
C  0.892348 -0.13379 0.504475
C  -0.605713 -0.089637 0.199901
C  -1.072348 0.200896 -1.106458
C  -1.538022 -0.321928 1.239361
C  1.666339 -1.150362 -0.347392
C  1.510563 1.256363 0.294354
C  -2.458794 0.251896 -1.365283
C  -2.925836 -0.271202 0.978058
C  -3.389117 0.015864 -0.326057
H  1.054195 -0.40152 1.562191
H  -0.355616 0.380886 -1.914172
H  -1.180874 -0.540817 2.252906
H  -2.813645 0.473498 -2.377729
H  -3.640031 -0.455108 1.788166
H  -4.464754 0.055384 -0.53106
H  3.487367 -1.906878 -0.405404
H  1.915216 2.871151 1.341178
