program: Gaussian 16
title: h_indole
version: ES64L-G16RevC.02
method: RwB97XD
basis: GenECP
operation: Freq
keyword: #N
keyword: Geom=AllCheck
keyword: Guess=TCheck
keyword: SCRF=Check
keyword: GenChk
keyword: RwB97XD/GenECP
keyword: Freq
converged: YES YES YES YES
title: Mulliken charges:
elementType: C C C C C C C C H H H N H B C H H H C H H H H H H H
charge: -0.181868 0.294534 -0.748014 -0.518994 0.715256 -0.661274 -0.400312 0.351413 0.184332 0.204425 0.215952 0.288868 0.271662 -0.271285 -0.403958 0.223516 0.200297 0.163861 -0.584600 0.167369 0.201482 0.162205 0.323837 -0.139276 -0.028457 -0.030972
chargesum: -0.00000
title: Mulliken charges with hydrogens summed into heavy atoms:
elementType: C C C C C C C C N B C C
charge: -0.181868 0.566196 -0.748014 -0.334662 0.715256 -0.456849 -0.184360 0.351413 0.612704 -0.469989 0.183716 -0.053544
chargesum: 0.00000
1716.lowfreq: -1479.2996 0.0001 0.0004 0.0007 12.7827 14.6127 26.0007 41.0241 102.5180
frequency: -1479.2989 40.9988 101.9493 126.0993 204.4106 219.4069 231.5599 283.6523 313.5282 334.2323 362.8483 381.7925 447.5131 459.2031 509.7942 570.9486 600.9343 615.2003 688.1637 753.7455 783.6144 812.7169 839.1956 843.5018 856.8758 901.0653 910.0441 927.8421 966.2844 988.6108 1019.0735 1027.5428 1043.0068 1065.6790 1083.9948 1153.2452 1164.7521 1167.6517 1172.8546 1186.7077 1220.7510 1232.1731 1268.2391 1295.2226 1316.2353 1368.3759 1403.2720 1418.9001 1458.6399 1475.0716 1490.8846 1497.1249 1500.4795 1507.5667 1538.5032 1645.1967 1676.1088 1692.9006 1723.1593 1758.4047 2491.2414 2558.2944 3044.6800 3067.3420 3111.8359 3135.2201 3158.6060 3173.2907 3184.4864 3193.9087 3207.1389 3243.5411
redmass: 1.0726 1.0195 3.0816 3.0640 3.0939 1.8965 1.5751 2.0727 2.4383 1.2450 2.9064 3.1668 4.2459 3.1684 3.2405 4.4896 3.1650 3.5249 5.1822 4.3851 3.4512 3.3771 1.9580 1.9619 1.4941 1.4491 1.5126 1.7085 2.1448 1.3459 1.3502 1.2720 2.5317 1.5574 3.3553 1.4249 1.2797 1.2343 2.2450 1.1638 1.4271 1.9184 2.1636 3.8589 1.6240 3.6513 1.3278 1.2661 1.2875 1.4671 1.0510 1.0731 1.1384 1.3743 3.1825 6.2854 4.2634 4.2549 1.2339 1.1636 1.0578 1.1179 1.0383 1.0323 1.0988 1.1031 1.1059 1.1060 1.0890 1.0923 1.0953 1.0968
irintensity: 5411.3901 0.4975 1.9952 0.8254 4.4646 0.3913 0.5065 5.2402 0.6027 5.1534 0.3811 3.3423 1.4834 6.5355 1.5330 4.7627 27.4854 6.1678 3.2638 7.8460 1.3882 12.8773 1.6587 15.5013 65.2127 32.8990 5.7124 66.3476 44.5448 1.0222 7.9316 20.2836 22.3192 13.4925 11.4480 6.8064 11.3688 59.3925 20.8280 23.4033 24.6471 25.7754 7.9905 51.8184 7.1469 4.6134 11.2572 0.8811 5.1073 4.1245 9.6704 6.0024 33.1107 32.0454 40.8982 22.0912 32.1594 71.8529 427.8985 90.4432 235.6819 194.8248 38.6642 26.6744 18.2214 17.9444 10.4541 4.2957 13.7304 8.6598 14.7233 5.9544
temp: 298.150 k
press: 1.00000 atm
elementType: 6 6 6 6 6 6 6 6 1 1 1 7 1 5 6 1 1 1 6 1 1 1 1 1 1 1
symmnumber: 1
zpe: 557561.7 jmol-1
zpe.correction: 0.212364 hartree
zpe.thermalcorrener: 0.223374 hartree
zpe.thermalcorrenthalpy: 0.224318 hartree
zpe.thermalcorrgfe: 0.175838 hartree
zpe.sumelectzpe: -468.758224 hartree
zpe.sumelectthermal: -468.747215 hartree
zpe.sumelectthermalent: -468.746271 hartree
zpe.sumelectthermalfe: -468.794750 hartree
dipole: -1.3097 5.2895 1.0650
dipole: 5.5524
quadrupole: -64.8107 -76.6493 -77.2023
quadrupole: -1.4407 2.1543 -1.8233
quadrupole: 8.0767 -3.7619 -4.3149 -1.4407 2.1543 -1.8233
hfenergy: -468.9705885 hartree
pointgroup: C01 [X(C10H14B1N1)]
dipole: -0.5152594 2.0810653 0.4190224 debye
dipolederiv: 0.1268564 0.0943814 -0.0040304 0.4321872 -0.2104972 0.1383974 -0.2439727 0.2677455 -0.2822343 -0.2721259 0.2721657 0.0252077 0.1956464 0.0839832 -0.0204177 0.1735747 -0.0519289 -0.1419125 0.4830807 -0.5567995 0.073103 -0.1605656 0.2364347 -0.0840916 0.1285014 -0.2334855 -0.0539353 -0.0094721 0.1775704 -0.0090796 0.041541 -0.1499787 0.0193317 0.0009283 0.029995 -0.1318058 -0.0992987 0.0650913 0.0029487 -0.0158351 0.3850701 -0.0688137 0.00829 -0.1248102 -0.091013 0.0973702 -0.1821289 0.0453003 0.061732 -0.2283643 0.0094452 0.0253083 -0.0021861 -0.1575141 0.1433738 0.0941082 0.0037836 0.025664 0.0229852 -0.0123531 -0.0008074 0.0341812 -0.1370068 -0.1879853 -0.0791139 -0.0094404 -0.3479731 0.312864 -0.0704525 -0.044433 0.0020722 0.0145298 -0.031304 -0.0833191 -0.0106072 -0.0662729 0.0520249 -0.0050146 -0.0036121 -0.0239258 0.1498103 -0.0620538 0.0977358 -0.0265494 0.1143665 0.0159525 0.0165681 -0.0212403 0.0078156 0.146124 -0.0450846 -0.0641039 -0.0136959 -0.0906889 0.0276811 0.0013691 -0.0073923 -0.0014235 0.1545684 -1.2333431 0.9265818 0.0490064 0.2238975 -1.0460857 -0.2594569 0.2586795 -0.5720321 -0.3226083 0.0388131 -0.0503768 -0.0247157 -0.0448496 -0.0283749 -0.0031644 -0.0387557 -0.0428587 0.1570069 0.4890862 0.1371223 0.0392124 -0.0000051 0.7332898 -0.0865389 0.1134998 -0.2465166 0.4483167 0.3751991 0.0824499 0.1567248 0.1204514 0.1039022 0.0725901 0.2230433 0.0782374 0.4408077 0.0052797 -0.0242611 0.1091179 -0.0243496 0.0758099 0.0011954 -0.0025706 -0.0399187 -0.055265 0.0055903 0.0489997 -0.0312386 0.1057768 0.0388524 0.0280181 -0.0107451 -0.004642 0.0716612 0.064598 -0.0597752 -0.0144754 -0.1207465 -0.0580824 -0.0140194 -0.0116604 0.036873 0.0356803 0.1169166 -0.0021814 0.0019993 0.0055815 -0.0217527 0.018401 -0.0295783 0.1669535 0.1073255 -0.0499781 -0.1005405 -0.0859292 -0.0080255 -0.0331534 -0.0074629 -0.0803959 -0.0856883 0.0380274 0.0999044 -0.0064047 0.0180176 0.0265793 -0.0847045 0.0355387 0.0111536 0.0945594 -0.1011368 -0.083298 0.1069956 0.061945 0.0262402 -0.0231611 0.0004356 0.0713167 -0.0591401 0.0686617 0.7327542 -1.0038749 -0.2939834 -0.8711982 1.3639778 0.3650802 -0.4646725 0.6647826 0.2521743 -0.2866373 0.0809304 0.1067343 0.1833919 -0.9333637 0.0056585 0.1156327 0.1071605 -0.1205148 -0.2862648 0.107837 -0.1092479 0.0977376 -0.2547939 0.0427643 -0.166604 0.1599745 -0.2618285 -0.1319771 -0.0790896 -0.0601081 0.0897168 -0.380515 -0.1230077 -0.0034883 -0.1617938 -0.2279189 unknown
polarizability: 188.074939|-36.1696891|216.1396371|9.9771181|-3.2022891|105.5485048 unknown
InChI: InChI=1/C10H14BN/c1-7-3-4-8-6-10(11)12(2)9(8)5-7/h3-6,12H,1-2,11H3
charge 0 multiplicity 1
26 atoms
C  -1.35011505 -1.39282854 0.06065627
C  -2.68014558 -1.28232637 -0.07434774
C  -1.87601912 0.87632576 -0.12040556
C  -1.85736859 2.25418267 -0.19539893
C  -3.07367474 2.92392878 -0.35930249
C  -4.25709638 2.17969946 -0.42042799
C  -4.2638998 0.79149244 -0.32732077
C  -3.05383321 0.12735685 -0.1682084
H  -0.9272708 2.8102989 -0.14275946
H  -5.19878348 2.70562883 -0.54070232
H  -5.1975824 0.24234943 -0.37080284
N  -0.77648631 -0.02313189 0.07245055
H  -3.35732817 -2.1135014 -0.21181357
B  -0.15797698 -2.41164916 -0.33779747
C  0.07021109 0.28355791 1.24570576
H  -0.53559617 0.26552978 2.15331612
H  0.85702564 -0.46688135 1.31367787
H  0.51722738 1.26819246 1.11350497
C  -3.10289841 4.42360111 -0.50201121
H  -2.27774091 4.89078857 0.03977506
H  -3.01490589 4.71420711 -1.55361785
H  -4.03870808 4.83878946 -0.12240928
H  0.05206603 -0.58332741 -0.76395326
H  0.61645125 -1.42663253 -0.99177582
H  0.57186497 -2.79538311 0.54340998
H  -0.42782437 -3.21164551 -1.19416253
