program: Gaussian 16
title: OCHO_H-TS1
version: ES64L-G16RevC.01
method: RwB97XD
basis: GenECP
operation: Freq
keyword: #N
keyword: Geom=AllCheck
keyword: Guess=TCheck
keyword: SCRF=Check
keyword: GenChk
keyword: RwB97XD/GenECP
keyword: Freq
converged: YES YES NO YES
title: Mulliken charges:
elementType: C C H C N N B H H H H H H H C O C O H
charge: -0.430521 -0.106068 0.251201 -0.154892 0.063446 -0.086953 -0.174768 0.299708 -0.082227 0.246375 0.214147 0.181841 -0.055165 -0.052462 -0.114757 -0.060928 0.073720 -0.227004 0.215308
chargesum: -0.00000
title: Mulliken charges with hydrogens summed into heavy atoms:
elementType: C C C N N B C O C O
charge: 0.211843 0.145133 -0.154892 0.063446 0.212755 -0.364623 -0.114757 -0.060928 0.289028 -0.227004
1716.lowfreq: -1282.7242 0.0007 0.0008 0.0009 4.3935 14.7441 21.4745 49.5227 110.9193
frequency: -1282.7242 49.0725 110.8763 122.1875 156.1078 203.8320 210.6152 261.7159 297.4893 339.4031 378.8993 563.1907 615.6493 629.1171 641.3062 678.3128 765.0436 834.9359 856.9433 891.5869 971.7216 985.7661 1018.6929 1054.4753 1075.7658 1114.8049 1124.1085 1152.6771 1174.2714 1204.3819 1220.6281 1279.0195 1295.3203 1392.7073 1396.2791 1460.3835 1493.1616 1505.6245 1546.7562 1577.4777 1628.4051 1853.1544 1858.5902 1887.0771 2486.5715 2534.8220 3074.2721 3125.8243 3159.1548 3176.9946 3290.9567
redmass: 1.0736 6.9497 1.5510 1.9714 2.8498 2.2855 2.1905 1.5143 2.8117 5.8949 4.5331 3.7563 4.4632 3.3165 5.2782 6.3918 1.3238 4.2011 9.9558 1.8308 1.0506 1.4606 6.2051 1.6127 1.9949 3.7085 1.0939 1.3162 1.1928 1.3938 2.1872 3.1549 1.9694 4.2190 1.1783 1.2771 1.0377 1.1853 3.8428 5.0686 5.1827 1.7074 2.3132 1.1043 1.0557 1.1194 1.0332 1.0980 1.1059 1.1054 1.0997
irintensity: 4323.1126 4.2149 1.5086 1.6789 1.2900 9.9840 9.6085 5.8505 4.7819 2.0192 8.9886 7.3560 11.6764 7.1777 6.1422 9.3576 46.0673 28.5892 17.1395 1.8874 1.5737 73.4363 41.1412 0.5884 73.7418 313.0975 53.4546 4.9644 21.2313 43.6926 194.0556 36.5426 138.8601 30.0889 4.6145 6.9448 22.7416 13.5052 315.4273 155.2562 40.4846 289.5862 199.1349 497.2532 183.0056 224.7722 26.7624 31.7056 5.8653 5.6571 0.5675
temp: 298.150 k
press: 1.00000 atm
elementType: 6 6 1 6 7 7 5 1 1 1 1 1 1 1 6 8 6 8 1
symmnumber: 1
zpe: 369204.3 jmol-1
zpe.correction: 0.140622 hartree
zpe.thermalcorrener: 0.150400 hartree
zpe.thermalcorrenthalpy: 0.151344 hartree
zpe.thermalcorrgfe: 0.105203 hartree
zpe.sumelectzpe: -480.508959 hartree
zpe.sumelectthermal: -480.499182 hartree
zpe.sumelectthermalent: -480.498237 hartree
zpe.sumelectthermalfe: -480.544378 hartree
dipole: 5.4287 5.0933 -0.9506
dipole: 7.5044
quadrupole: -68.1099 -62.2363 -70.2680
quadrupole: -14.9517 5.0321 0.5526
quadrupole: -1.2385 4.6351 -3.3966 -14.9517 5.0321 0.5526
hfenergy: -480.6495812 hartree
pointgroup: C01 [X(C5H9B1N2O2)]
dipole: 2.1358152 2.0038616 -0.3739967 debye
dipolederiv: 0.6228189 0.1234072 -0.1086592 0.1565687 0.2028483 -0.0248311 -0.0686283 -0.0204253 0.2443101 0.0459244 -0.1112545 0.0132381 0.2715189 0.0621656 -0.0539273 -0.0887231 -0.0584504 -0.1602021 0.0305609 0.0418768 0.0093183 0.0247971 0.0751373 0.0407337 0.0105552 0.0331612 0.1915467 -0.0484977 0.1466355 -0.0641542 -0.0804026 -0.1496423 0.0331983 0.0142315 -0.0127897 -0.1669874 -0.9729094 -0.2137169 0.1905509 -0.3748111 -0.2195692 0.0938586 0.1187887 0.0376727 -0.161177 -1.2932263 -0.7570809 0.3891422 -0.4280116 -0.9342584 0.3523704 0.2658824 0.3033112 -0.3735252 0.415373 -0.2016417 0.0630757 -0.0375726 0.7136668 -0.0730524 0.0170422 -0.0425907 0.495683 0.9996715 0.9680249 -0.4447057 0.8052652 1.0334526 -0.4113899 -0.3515778 -0.3945776 0.3163398 -0.2540793 0.0291499 0.0276449 -0.1720383 -0.7263077 0.2587238 0.0827161 0.2131484 -0.0886946 -0.0283238 -0.0502228 -0.0049993 -0.0359371 0.0811765 -0.0327505 0.09131 -0.0040083 -0.0628941 0.0285096 0.0171222 0.0483649 -0.0664349 -0.0621867 -0.021541 0.0325627 -0.0380143 0.0886506 -0.0160302 -0.0072509 -0.0051278 0.0721327 0.044899 0.0753141 -0.0714054 0.070732 0.0439496 -0.1560913 0.0071926 0.012076 -0.0646274 -0.1980695 0.0865855 0.1065287 0.1444307 -0.4175326 -0.1850987 -0.0491159 -0.0285625 -0.148086 -0.3562958 -0.0698249 -0.0764083 -0.1602234 -0.2159695 1.028807 0.0696744 -0.0903222 0.1071011 1.4098778 -0.664727 -0.096131 -0.3490598 0.4445095 -0.3309719 -0.0291213 0.0928726 -0.039526 -1.4176149 0.8247286 0.1250228 0.7148952 -1.4424255 0.3738084 -0.0054274 -0.2651102 -0.1103295 1.1504924 0.0241928 -0.2198738 -0.6297369 2.3909797 -0.3786966 0.0111205 0.1522331 0.1042789 -0.6258284 -0.4613714 0.1007321 0.1616725 -1.1847281 0.1184515 0.0106283 0.0131246 0.0161145 -0.0839434 0.0237098 0.0073751 0.0308525 0.058167 unknown
polarizability: 114.7410422|12.2017577|120.5620937|-11.2164452|-18.8450918|90.93575 unknown
InChI: InChI=1/C5H9BN2O2/c1-8-2-4(6)7-5(8)10-3-9/h2-3,7H,1,6H3
charge 0 multiplicity 1
19 atoms
C  1.30177833 0.15915814 -0.25267251
C  -0.39964384 -1.56278442 0.51886559
H  0.34622596 -2.32746118 0.65655147
C  -1.75249491 -1.56494522 0.68359838
N  -0.03486094 -0.2876308 0.10117713
N  -2.20169743 -0.29276024 0.35635297
B  -3.02844827 -2.43506404 1.11089375
H  -3.43091154 -0.72410686 0.64506076
H  -3.99784205 -1.47200878 0.94108731
H  1.4878805 -0.00366812 -1.31507937
H  1.40490012 1.2188291 -0.02034176
H  2.0234302 -0.40078377 0.33933988
H  -3.13652 -2.70703673 2.2817342
H  -3.38375376 -3.29835134 0.34671533
C  -1.16370256 0.42850383 0.01306504
O  -1.19698913 1.74685761 -0.31138469
C  -1.07082069 2.07499272 -1.63082751
O  -0.86683204 1.29691814 -2.50542962
H  -1.17834494 3.15933694 -1.72861638
