program: Gaussian 16
title: OH_H-TS1
version: ES64L-G16RevC.01
method: RwB97XD
basis: GenECP
operation: Freq
keyword: #N
keyword: Geom=AllCheck
keyword: Guess=TCheck
keyword: SCRF=Check
keyword: GenChk
keyword: RwB97XD/GenECP
keyword: Freq
converged: YES YES NO NO
title: Mulliken charges:
elementType: C C H C N N B H H H H H H H C O H
charge: -0.414469 -0.176008 0.239721 -0.163285 -0.027591 -0.147351 -0.167760 0.283103 -0.079409 0.204281 0.197621 0.209866 -0.054700 -0.054627 0.113802 -0.301916 0.338721
chargesum: -0.00000
title: Mulliken charges with hydrogens summed into heavy atoms:
elementType: C C C N N B C O
charge: 0.197300 0.063713 -0.163285 -0.027591 0.135753 -0.356496 0.113802 0.036804
chargesum: 0.00000
1716.lowfreq: -1249.1149 -0.0002 0.0003 0.0005 8.4567 11.8268 22.6502 34.0908 135.8577
frequency: -1249.1149 33.0768 135.8509 191.2656 232.2088 288.1676 303.9099 326.4134 336.1440 557.9498 612.9153 620.8135 694.3482 707.1667 751.7659 851.9968 886.0806 969.4923 979.3675 1015.5502 1075.8772 1109.5029 1155.7237 1162.3352 1192.6542 1204.0937 1215.3854 1283.6950 1327.7010 1374.1750 1463.3487 1492.9821 1511.7009 1585.0614 1629.1938 1654.8380 1844.1900 1908.0010 2480.8300 2527.5393 3069.1039 3145.6439 3180.0817 3289.6207 3894.5612
redmass: 1.0758 1.0529 2.5913 2.0982 1.3223 2.9352 1.2696 3.8751 3.5897 3.0863 4.5027 3.1136 7.1852 3.0954 1.6818 3.4856 1.8129 1.0504 1.4291 6.3106 1.6673 1.0341 1.3013 1.2780 1.4558 2.1167 1.5579 1.8071 2.3536 4.3553 1.2261 1.0369 1.0706 4.6739 6.6066 4.8626 1.0909 1.1077 1.0556 1.1194 1.0339 1.1065 1.1037 1.0997 1.0661
irintensity: 4135.6660 0.2471 2.9797 11.4265 0.7861 2.5001 112.6512 30.4771 21.1931 4.2477 12.6975 4.0421 60.8102 51.9029 17.2070 9.4919 2.2145 3.1676 68.2336 31.6237 15.1846 12.8775 0.8525 82.6826 79.9482 59.3707 21.3877 170.9502 13.4321 66.9663 7.8457 14.9495 6.8453 548.8642 66.2548 152.3264 152.5464 499.3920 181.3713 234.0355 42.7721 13.3457 2.8736 0.5117 187.0921
temp: 298.150 k
press: 1.00000 atm
elementType: 6 6 1 6 7 7 5 1 1 1 1 1 1 1 6 8 1
symmnumber: 1
zpe: 342564.6 jmol-1
zpe.correction: 0.130476 hartree
zpe.thermalcorrener: 0.138789 hartree
zpe.thermalcorrenthalpy: 0.139733 hartree
zpe.thermalcorrgfe: 0.097239 hartree
zpe.sumelectzpe: -367.202882 hartree
zpe.sumelectthermal: -367.194569 hartree
zpe.sumelectthermalent: -367.193625 hartree
zpe.sumelectthermalfe: -367.236119 hartree
dipole: 4.5091 4.1843 -2.0794
dipole: 6.4934
quadrupole: -56.2881 -57.1336 -52.1015
quadrupole: -16.1986 8.3322 0.4233
quadrupole: -1.1137 -1.9592 3.0729 -16.1986 8.3322 0.4233
hfenergy: -367.333358 hartree
pointgroup: C01 [X(C4H9B1N2O1)]
dipole: 1.7740222 1.6462384 -0.8180847 debye
dipolederiv: 0.7385283 0.0747068 0.0034151 0.1202168 0.1826772 0.0586803 -0.0311002 0.0569607 0.2277092 0.0005916 0.0082234 0.012886 0.312513 0.0655686 -0.1365798 -0.1678187 -0.1595537 -0.1329042 0.0298367 0.0370022 -0.0353746 0.0200935 0.0915068 0.0719021 -0.0249752 0.0727831 0.1689084 -0.0307045 0.0272593 -0.0044915 -0.1587489 -0.0827282 -0.0632682 0.1038904 -0.0502067 -0.1379113 -1.0880597 -0.0406248 -0.053894 -0.3241672 -0.2967244 0.0588582 0.1253093 0.0824311 -0.1904046 -1.4627608 -0.8602656 0.4044504 -0.3703013 -1.0080996 0.392159 0.1219236 0.3557532 -0.4730597 0.4084737 -0.1710877 0.0921219 -0.0142416 0.6791193 -0.1094541 0.0030099 -0.1204338 0.5616469 1.1771321 0.9484227 -0.4672253 0.7862006 0.8310659 -0.3393337 -0.3744033 -0.327231 0.2988938 -0.2859055 -0.0348208 -0.0013644 -0.211528 -0.5916702 0.3220294 0.1008578 0.3354698 -0.1910334 -0.0678623 -0.0087947 0.0215345 0.0910782 -0.0153096 -0.0812991 0.0592521 -0.0660381 0.0584444 0.0399161 0.0216169 -0.021923 -0.0542058 0.0058012 0.0626937 0.0240617 0.0691117 0.0704975 -0.0584266 -0.0336893 -0.0018836 -0.0291929 0.0953092 -0.0131104 -0.1061436 -0.0385091 -0.0749692 -0.2003637 -0.0040116 0.0632543 -0.0427883 -0.1614575 0.0142413 0.1775519 0.0832195 -0.4136005 -0.1790894 -0.0289786 -0.0247405 -0.1543611 -0.4061064 -0.0723176 -0.0450038 -0.1290566 -0.1921438 1.0541864 0.1494563 -0.0300346 0.0831695 1.6144024 -0.7383826 0.0059595 -0.732829 0.7529089 -0.3498635 -0.0104856 0.0100695 0.0095362 -1.4614633 0.6201492 0.0005871 0.6148214 -0.7503177 0.2743711 -0.0739289 0.0332 -0.0632727 0.4581086 -0.0469676 0.0270415 -0.0466925 0.4173351 unknown
polarizability: 113.6284575|12.7824528|95.9755779|-3.4176074|-17.3651583|73.9729765 unknown
InChI: InChI=1/C4H9BN2O/c1-7-2-3(5)6-4(7)8/h2,6,8H,1,5H3
charge 0 multiplicity 1
17 atoms
C  1.58648178 -0.00186143 -0.04408571
C  -0.31666803 -1.5287337 0.68598271
H  0.3499371 -2.23781857 1.14706802
C  -1.66708476 -1.493283 0.56056282
N  0.1894551 -0.38123106 0.06078588
N  -1.98352702 -0.32500087 -0.13922435
B  -3.04243602 -2.24520846 0.88682326
H  -3.26657233 -0.69623097 -0.02372729
H  -3.91606685 -1.34901538 0.30410757
H  2.14639563 -0.78822983 -0.55174601
H  1.66185932 0.91844471 -0.61989998
H  2.00504959 0.1620165 0.94991411
H  -3.41210908 -2.24521124 2.03602339
H  -3.275685 -3.25814162 0.27273362
C  -0.86054023 0.30068035 -0.41395599
O  -0.7009111 1.45090246 -1.06607835
H  -1.56319085 1.78135296 -1.33311288
