program: Gaussian 16
title: NO2_H-TS1
version: ES64L-G16RevC.01
method: RwB97XD
basis: GenECP
operation: Freq
keyword: #N
keyword: Geom=AllCheck
keyword: Guess=TCheck
keyword: SCRF=Check
keyword: GenChk
keyword: RwB97XD/GenECP
keyword: Freq
converged: YES YES YES YES
title: Mulliken charges:
elementType: C C H C N N B H H H H H H H C N O O
charge: -0.432911 0.140203 0.283840 -0.189101 0.019205 -0.015329 -0.202114 0.328939 -0.074327 0.170539 0.243149 0.243485 -0.044496 -0.044486 -0.078470 -0.352753 -0.022551 0.027179
chargesum: -0.00000
title: Mulliken charges with hydrogens summed into heavy atoms:
elementType: C C C N N B C N O O
charge: 0.224262 0.424042 -0.189101 0.019205 0.313609 -0.365422 -0.078470 -0.352753 -0.022551 0.027179
1716.lowfreq: -1353.8971 -0.0005 -0.0005 0.0005 3.5098 9.8792 11.8752 54.8368 134.8341
frequency: -1353.8970 54.6457 134.8305 173.4378 211.3012 225.0508 260.0354 292.5539 319.8218 420.5138 452.8717 591.8217 623.6006 626.0561 642.1392 733.7368 799.3049 808.6125 885.5005 895.3835 969.5547 988.3179 1018.6803 1086.3261 1136.9134 1153.3508 1177.8271 1200.1045 1218.6017 1289.9205 1311.4193 1408.3752 1421.3923 1447.4748 1468.1583 1489.3829 1514.6524 1562.3223 1602.1653 1648.8332 1828.7194 1886.0804 2497.2318 2549.0312 3094.5399 3188.7225 3194.2299 3290.0837
redmass: 1.0647 8.2374 3.1127 2.8033 5.0153 1.1595 1.5656 2.0588 3.0567 6.4550 6.7608 4.3864 4.3913 3.6134 4.7002 10.5642 5.5590 1.3004 8.3337 1.8877 1.0500 1.5359 4.8607 1.7840 1.0464 1.3069 1.1668 2.6565 1.4649 4.2001 1.4582 7.1633 4.2092 6.8584 1.2690 1.0388 1.1817 4.5933 4.8344 12.5368 1.1261 1.0594 1.0558 1.1197 1.0317 1.1070 1.1073 1.1000
irintensity: 4067.6882 1.8568 0.6485 5.2188 5.4714 0.2759 1.6259 3.8627 1.6201 0.2378 1.6375 0.1391 11.1425 12.8523 8.3850 0.5594 3.3026 35.9830 98.3104 0.2802 2.6004 47.1886 77.3058 57.0214 14.0820 0.4843 40.9613 35.4973 1.3049 335.7963 98.3197 52.7038 75.2319 544.1961 16.7185 16.1124 11.2156 211.2325 13.8725 347.4084 462.2558 252.7039 170.7798 203.4112 11.5134 2.4644 3.8907 1.7704
temp: 298.150 k
press: 1.00000 atm
elementType: 6 6 1 6 7 7 5 1 1 1 1 1 1 1 6 7 8 8
symmnumber: 1
zpe: 339701.3 jmol-1
zpe.correction: 0.129385 hartree
zpe.thermalcorrener: 0.138497 hartree
zpe.thermalcorrenthalpy: 0.139441 hartree
zpe.thermalcorrgfe: 0.094976 hartree
zpe.sumelectzpe: -496.458828 hartree
zpe.sumelectthermal: -496.449716 hartree
zpe.sumelectthermalent: -496.448772 hartree
zpe.sumelectthermalfe: -496.493237 hartree
dipole: 6.0813 -0.9429 0.7822
dipole: 6.2035
quadrupole: -69.2029 -74.2044 -63.9748
quadrupole: -9.1912 3.1464 6.7090
quadrupole: -0.0756 -5.0770 5.1526 -9.1912 3.1464 6.7090
hfenergy: -496.5882131 hartree
pointgroup: C01 [X(C4H8B1N3O2)]
dipole: 2.3925624 -0.3709632 0.3077355 debye
dipolederiv: 0.6035277 0.0664982 -0.015101 0.0429197 0.2286585 -0.0121358 -0.0021328 -0.0117355 0.205504 0.147839 -0.6854502 0.3648934 0.1806408 -0.3549611 0.1357145 -0.0799941 0.0920019 -0.157044 0.0476162 0.027124 -0.0210956 0.011699 0.1216626 0.0344258 -0.0115076 0.0343249 0.1696912 0.0224382 0.7540856 -0.380353 0.019354 -0.4694929 0.1885206 -0.0032163 0.2252433 -0.2197246 -0.8746107 -0.390942 0.1621256 -0.2594412 0.4438649 -0.2950488 0.0933827 -0.303005 0.0545521 -1.3449879 -0.4160853 0.1557401 -0.4278146 -0.1160408 -0.0649657 0.1608725 -0.0636572 -0.1583906 0.3399851 -0.1419148 0.0674103 -0.0053917 0.6580878 -0.1076353 -0.0024378 -0.1147221 0.5091513 1.2375851 0.9340836 -0.423992 0.7994322 0.8314547 -0.3139025 -0.3547649 -0.3065754 0.2800684 -0.2606842 -0.0482022 0.0120234 -0.2295957 -0.6053282 0.2947306 0.1046384 0.3033985 -0.1603058 0.0291112 -0.0170183 0.0044411 0.0849228 -0.0113258 0.0691773 -0.0505839 0.0655883 0.0791606 -0.0070616 -0.0051782 -0.0296539 -0.0368761 0.0968993 0.0074543 0.0350522 0.0072623 -0.0297954 -0.0091426 0.0222417 0.0181631 -0.0473288 0.0067906 -0.0610864 0.0069598 -0.0581649 0.0628243 -0.1692237 -0.0307159 0.0582746 -0.0476553 -0.1546578 0.0272428 0.1487495 0.0996644 -0.3960679 -0.1567436 -0.0454333 -0.0054372 -0.1351644 -0.3822455 -0.0694596 -0.040916 -0.1358172 -0.1807357 0.6432679 -0.0339807 0.0389203 0.0340456 -0.8774015 0.5847265 0.0042891 0.586314 -0.0369041 2.0790851 -0.0049848 0.0946539 0.0362865 2.3688369 -1.0666807 0.0749995 -1.0682502 0.836148 -1.2236161 -0.4655159 0.1898329 -0.3901723 -0.8903618 0.3013231 0.1493226 0.2959962 -0.4102649 -1.1043852 0.4813887 -0.2908461 0.3701393 -0.8944398 0.3475995 -0.2327128 0.3521336 -0.4478671 unknown
polarizability: 130.1565221|14.966098|133.503825|-4.4409285|-33.9854752|83.0005383 unknown
InChI: InChI=1/C4H8BN3O2/c1-7-2-3(5)6-4(7)8(9)10/h2,6H,1,5H3
charge 0 multiplicity 1
18 atoms
C  1.63848032 -0.09515917 -0.05680618
C  -0.29034554 -1.5567633 0.59938399
H  0.37114577 -2.29891451 1.01447985
C  -1.66462528 -1.51131544 0.50692434
N  0.21321222 -0.41274519 0.03707099
N  -1.97229729 -0.33510461 -0.11234039
B  -3.03576445 -2.27702034 0.83071749
H  -3.24653109 -0.65831176 -0.01117113
H  -3.89649796 -1.34831539 0.30942411
H  2.18335519 -0.92301251 0.39150531
H  1.92780723 0.01960697 -1.09899758
H  1.85231017 0.82611797 0.48035599
H  -3.35730116 -2.33303128 1.99075851
H  -3.26513217 -3.26430803 0.17889872
C  -0.85098715 0.30436351 -0.38400398
N  -0.79491427 1.57943106 -1.03460206
O  0.30883547 2.06498778 -1.22609967
O  -1.85176344 2.08417256 -1.3478395
