program: Gaussian 16
title: MeQHBH2 TS1
version: ES64L-G16RevC.01
method: RwB97XD
basis: GenECP
operation: Freq
keyword: #N
keyword: Geom=AllCheck
keyword: Guess=TCheck
keyword: SCRF=Check
keyword: GenChk
keyword: RwB97XD/GenECP
keyword: Freq
converged: YES YES YES YES
title: Mulliken charges:
elementType: C C H C N N N B H H H H H H H
charge: -0.388326 -0.250789 0.253430 -0.105826 0.242127 -0.320855 -0.034331 -0.197018 0.329444 -0.063422 0.201905 0.212157 0.211615 -0.045098 -0.045013
chargesum: -0.00000
title: Mulliken charges with hydrogens summed into heavy atoms:
elementType: C C C N N N B
charge: 0.237351 0.002642 -0.105826 0.242127 -0.320855 0.295113 -0.350552
chargesum: 0.00000
1716.lowfreq: -1252.0198 -11.6542 0.0005 0.0005 0.0008 8.0921 18.0404 53.8746 144.8346
frequency: -1252.0198 52.7111 144.8177 265.3514 298.3281 311.7844 491.4773 623.1774 639.3617 698.2288 783.3791 816.6315 892.6623 959.2066 963.1078 1061.3140 1074.0697 1087.7301 1128.4082 1155.9175 1159.7896 1192.0934 1256.5032 1319.7326 1341.5504 1398.2869 1454.3923 1481.9155 1487.4934 1515.7219 1602.9298 1850.2228 1890.2883 2499.0749 2552.3177 3080.6090 3165.1485 3195.1939 3298.1177
redmass: 1.0777 1.0755 2.4977 1.6815 1.6919 2.7874 3.1774 4.4424 3.0972 6.7381 3.9877 1.2704 1.8811 1.4174 1.0482 5.1096 2.7328 2.2041 1.0476 1.3143 1.3317 1.3047 1.5414 5.3992 3.0800 4.3681 1.4022 2.2712 1.0505 1.2971 5.4130 1.0582 1.0623 1.0551 1.1207 1.0331 1.1069 1.1051 1.1012
irintensity: 3326.6035 0.0976 0.2655 9.2168 3.6620 2.9557 1.5826 8.5490 1.7600 1.3985 20.1484 40.6847 0.1155 57.2385 3.5999 49.8955 3.9322 17.3814 13.0473 1.1031 3.1504 51.9361 183.8869 10.1583 66.2416 7.7756 9.4165 20.5141 17.0003 2.7850 2.4071 168.0514 638.3151 153.1402 208.6603 23.5879 6.1579 0.7800 1.8367
temp: 298.150 k
press: 1.00000 atm
elementType: 6 6 1 6 7 7 7 5 1 1 1 1 1 1 1
symmnumber: 1
zpe: 300197.2 jmol-1
zpe.correction: 0.114339 hartree
zpe.thermalcorrener: 0.121105 hartree
zpe.thermalcorrenthalpy: 0.122049 hartree
zpe.thermalcorrgfe: 0.083300 hartree
zpe.sumelectzpe: -307.997455 hartree
zpe.sumelectthermal: -307.990690 hartree
zpe.sumelectthermalent: -307.989746 hartree
zpe.sumelectthermalfe: -308.028495 hartree
dipole: 6.0924 0.9498 -0.2891
dipole: 6.1728
quadrupole: -50.2112 -50.3630 -46.6272
quadrupole: -10.3386 4.2913 1.8892
quadrupole: -1.1440 -1.2959 2.4399 -10.3386 4.2913 1.8892
hfenergy: -308.1117944 hartree
pointgroup: C01 [X(C3H8B1N3)]
dipole: 2.3969436 0.3736686 -0.1137378 debye
dipolederiv: 0.6135519 0.1099208 -0.0328416 0.1419265 0.1983348 0.0251555 -0.0713589 0.0209729 0.2085485 0.1040244 -0.2251122 0.1252173 0.1659818 -0.0518084 -0.0128396 -0.088096 -0.0266543 -0.0775509 0.0616412 0.0323184 -0.0209979 0.0221403 0.1203589 0.0449053 -0.0146004 0.0452029 0.1808389 -0.093124 0.2418341 -0.1283458 0.0361075 -0.2560303 0.0910892 -0.0192585 0.0939476 -0.1413705 -0.7493068 -0.2134616 0.0858929 -0.1084942 0.2167489 -0.1528558 0.0580357 -0.148121 0.0136101 0.2231234 -0.1880235 0.1098218 -0.0682084 -0.4228484 0.1771178 0.0423822 0.1681432 -0.1679774 -1.1335265 -0.3053884 0.126167 -0.4823259 -0.2071855 -0.0130381 0.2228549 -0.0023555 -0.1825757 0.3617625 -0.1400439 0.0701786 0.0096721 0.685015 -0.1120215 -0.0079836 -0.1174903 0.5326647 1.2609645 0.803517 -0.3837657 0.7481689 0.6714071 -0.2542085 -0.356628 -0.2525504 0.2597986 -0.2714094 -0.0366805 0.010359 -0.240583 -0.5567288 0.2825456 0.1174817 0.2889711 -0.1500557 -0.0384749 -0.0298799 0.0254416 0.0558237 -0.0078991 -0.0743931 0.0580939 -0.0535561 0.0708868 0.0504869 0.0419555 -0.0325458 -0.0439582 0.0246854 0.0578444 0.0206531 0.0627219 0.0805988 -0.0430587 -0.0446312 0.0132644 -0.0399145 0.0974655 -0.0020026 -0.0729123 -0.028172 -0.0489237 -0.1773643 -0.0083102 0.0532 -0.0467653 -0.1528332 0.019149 0.1596515 0.0720097 -0.3878668 -0.1692901 -0.0380143 -0.0210457 -0.1495714 -0.3586819 -0.0764477 -0.0483152 -0.1230697 -0.1906259 unknown
polarizability: 106.4313524|13.4111598|84.0025174|-5.2706764|-13.2047537|64.5855907 unknown
InChI: InChI=1/C3H8BN3/c1-7-2-3(4)5-6-7/h2,5H,1,4H3
charge 0 multiplicity 1
15 atoms
C  1.60778013 -0.07432776 -0.06048951
C  -0.25805579 -1.61513513 0.67320593
H  0.40319909 -2.35963793 1.08283345
C  -1.62549472 -1.52592385 0.58429055
N  0.22043017 -0.48073248 0.09337124
N  -0.75211422 0.29809977 -0.34394284
N  -1.84631541 -0.3394492 -0.04374419
B  -3.04514185 -2.19426626 0.88803889
H  -3.17047265 -0.57543422 0.03632472
H  -3.84844174 -1.20899054 0.34669853
H  2.15945396 -0.85200598 -0.5876586
H  1.62030221 0.84507338 -0.64080899
H  2.05208962 0.10036738 0.91925413
H  -3.40019526 -2.21180769 2.03906273
H  -3.34198518 -3.1582695 0.22939325
