program: Gaussian 16
title: h_naphthalene
version: ES64L-G16RevC.02
method: RwB97XD
basis: GenECP
operation: Freq
keyword: #N
keyword: Geom=AllCheck
keyword: Guess=TCheck
keyword: SCRF=Check
keyword: GenChk
keyword: RwB97XD/GenECP
keyword: Freq
converged: YES YES YES YES
title: Mulliken charges:
elementType: C C C C C C H C C H H C C H H H B N C H H H C H H H H H H H
charge: -0.282088 0.007652 0.345378 0.380968 -0.226187 -0.422876 0.165322 0.335459 -0.266607 0.180025 0.233426 -0.592412 -0.641396 0.194196 0.227435 0.218154 -0.477551 0.033390 -0.365103 0.142609 0.180095 0.204018 -0.450322 0.194725 0.174088 0.183806 0.197037 0.088904 -0.011357 0.049212
chargesum: -0.00000
title: Mulliken charges with hydrogens summed into heavy atoms:
elementType: C C C C C C C C C C B N C C
charge: -0.116766 0.007652 0.345378 0.380968 -0.046162 -0.189449 0.335459 -0.072411 -0.364977 -0.423242 -0.153755 0.033390 0.161619 0.102296
1716.lowfreq: -379.3485 -35.3700 -8.6757 -0.0003 0.0005 0.0006 11.8644 26.5338 133.5056
frequency: -379.3032 3.1334 133.2947 142.5093 177.6675 187.6816 214.7192 256.9350 288.3133 309.6955 323.1387 346.3698 404.9815 413.2086 455.0605 476.4051 495.8981 502.9286 537.6933 557.6565 568.0400 599.6006 640.6646 662.8289 687.7891 771.7585 791.4735 804.9404 810.7462 824.8310 871.3233 918.2810 927.4959 945.9582 956.8164 1004.3209 1014.4966 1018.3647 1055.2064 1076.1764 1092.1030 1116.6460 1127.3202 1137.0945 1177.9733 1190.1743 1195.2787 1208.5887 1219.5463 1227.8803 1238.7196 1253.5818 1276.2409 1337.0616 1372.5039 1397.6298 1413.4567 1447.6896 1467.8551 1475.7485 1482.4386 1494.6801 1501.3916 1510.5845 1525.4431 1564.2422 1646.1004 1665.7621 1689.5466 2527.5977 2593.1399 2984.6160 2992.3266 3079.5261 3090.6271 3136.1868 3152.8906 3175.3585 3183.6314 3185.1310 3200.0831 3205.2620 3213.7195 3755.9601
redmass: 1.2097 2.9633 2.6788 2.9388 3.5291 2.5141 2.7158 1.0847 1.2931 1.8829 2.1524 3.0571 1.5931 2.2507 3.7651 2.9356 3.6134 3.5078 2.8333 2.0838 2.0551 2.5332 3.6311 1.7788 2.9932 1.3385 4.7356 1.6461 4.7172 1.5390 2.7514 2.0196 1.4397 1.5594 1.3913 1.3268 1.3505 3.2182 3.6659 1.5085 1.3838 1.3156 1.7302 1.7518 1.3402 1.4002 1.2278 1.1241 1.2214 2.4218 1.6356 2.5060 2.0165 2.4148 3.2362 4.4732 3.4251 1.1621 1.7798 1.2721 1.0541 1.0939 1.2088 1.8070 1.0862 4.3903 6.4166 5.5858 6.3641 1.0614 1.1155 1.0512 1.0502 1.0859 1.0858 1.1024 1.1009 1.0871 1.0884 1.0886 1.0923 1.0982 1.0966 1.0089
irintensity: 211.1373 0.5569 0.2652 0.5663 4.3475 0.2119 4.5265 0.3165 0.4536 3.8343 0.2706 6.3169 25.6312 9.5285 0.9831 10.7092 5.2401 7.1926 7.4492 45.3306 5.8524 19.2229 26.0110 25.2955 2.9046 10.6023 6.1935 63.8612 4.2855 42.8115 17.1900 35.5589 0.8862 8.7880 8.6533 0.2142 1.4028 24.5937 29.7405 19.9663 28.0129 8.4417 5.1810 58.1261 10.6572 31.4869 16.7651 47.1019 32.0650 8.2357 13.7932 16.9677 14.3392 7.1643 24.2832 12.4553 19.2570 1.7593 3.8138 0.3996 5.5061 17.5772 13.7725 28.4482 22.4837 19.2327 23.1643 1.4689 8.4599 219.8099 143.1102 77.6965 112.5800 42.1985 33.8803 20.7353 17.2691 5.9545 6.4450 9.9397 22.7448 39.0377 18.4654 462.1837
temp: 298.150 k
press: 1.00000 atm
elementType: 6 6 6 6 6 6 1 6 6 1 1 6 6 1 1 1 5 7 6 1 1 1 6 1 1 1 1 1 1 1
symmnumber: 1
zpe: 652609.2 jmol-1
zpe.correction: 0.248566 hartree
zpe.thermalcorrener: 0.261235 hartree
zpe.thermalcorrenthalpy: 0.262179 hartree
zpe.thermalcorrgfe: 0.208412 hartree
zpe.sumelectzpe: -546.160898 hartree
zpe.sumelectthermal: -546.148229 hartree
zpe.sumelectthermalent: -546.147285 hartree
zpe.sumelectthermalfe: -546.201052 hartree
dipole: -1.5748 -2.1322 0.8432
dipole: 2.7816
quadrupole: -85.5800 -73.0922 -87.9752
quadrupole: 0.5286 -2.1604 -0.7996
quadrupole: -3.3642 9.1236 -5.7594 0.5286 -2.1604 -0.7996
hfenergy: -546.4094641 hartree
pointgroup: C01 [X(C12H16B1N1)]
dipole: -0.6195894 -0.8388814 0.3317324 debye
polarizability: 216.3050842|16.4878956|234.5412064|-41.4990876|8.9127175|140.1331975 unknown
InChI: InChI=1/C12H14BN.2H/c1-14(2)11-8-4-6-9-5-3-7-10(13)12(9)11;;/h3-8H,13H2,1-2H3;;
charge 0 multiplicity 1
30 atoms
C  -2.04345126 -0.92865405 1.56249754
C  -0.82595596 -0.77770519 0.9436133
C  -0.21380571 0.51757983 0.83578669
C  -0.96377644 1.6269082 1.33420961
C  -2.22459292 1.42819117 1.95260887
C  -2.74663833 0.17438613 2.08332529
H  -2.48609585 -1.91490437 1.63723383
C  1.1074165 0.74867767 0.30968822
C  -0.44046161 2.94070998 1.23173399
H  -2.76012099 2.29327203 2.32975702
H  -3.70503104 0.02083323 2.56625212
C  0.79668369 3.15263995 0.69791604
C  1.56620465 2.05120572 0.27220559
H  -1.03845071 3.76859776 1.59878113
H  1.20306588 4.15548133 0.62568409
H  2.57099086 2.23902539 -0.09361869
B  2.14394223 -0.30345304 -0.28577771
N  -0.16315711 -1.91107579 0.36895972
C  -0.2786419 -3.15779526 1.11276764
H  -1.272172 -3.62384809 1.03721371
H  0.45029491 -3.8693953 0.71409362
H  -0.05254996 -2.98253047 2.16584234
C  -0.51865805 -2.0933105 -1.03749066
H  0.15842388 -2.82046501 -1.49345097
H  -1.55400307 -2.45162408 -1.14594792
H  -0.41707139 -1.14842241 -1.57058631
H  1.67858691 -1.57796294 0.57780267
H  2.42112468 -1.47645251 0.80739641
H  3.30325446 -0.01520846 -0.14395472
H  1.89301767 -0.9169259 -1.28392844
