program: Gaussian 16
title: H_H-TS1
version: ES64L-G16RevC.01
method: RwB97XD
basis: GenECP
operation: Freq
keyword: #N
keyword: Geom=AllCheck
keyword: Guess=TCheck
keyword: SCRF=Check
keyword: GenChk
keyword: RwB97XD/GenECP
keyword: Freq
converged: YES YES YES YES
title: Mulliken charges:
elementType: C C H C N N B H H H H H H H C H
charge: -0.395590 -0.223444 0.228397 -0.127616 0.018224 -0.093071 -0.140168 0.269170 -0.071194 0.207709 0.162884 0.207474 -0.054650 -0.054476 -0.170894 0.237244
chargesum: -0.00000
title: Mulliken charges with hydrogens summed into heavy atoms:
elementType: C C C N N B C
charge: 0.182477 0.004953 -0.127616 0.018224 0.176099 -0.320487 0.066350
1716.lowfreq: -1171.9189 -12.4381 -11.0410 -0.0009 -0.0008 -0.0004 15.4997 73.5680 143.9259
frequency: -1171.9188 73.4853 143.9201 238.0449 271.5961 305.4601 482.5588 619.4251 621.7073 653.2884 763.9586 764.6073 833.8776 889.4249 962.9234 964.5773 1008.0984 1056.2234 1096.1605 1111.4289 1154.8019 1159.3540 1180.6656 1200.5937 1278.0176 1290.4170 1400.8504 1430.5380 1464.9638 1486.1293 1520.8935 1567.9328 1618.6251 1812.8632 1990.7906 2485.2536 2532.7657 3069.4329 3149.4890 3170.0528 3279.2714 3284.9990
redmass: 1.0825 1.0888 2.4624 1.3553 2.1194 2.7236 2.9254 4.4827 2.9719 2.8943 3.1717 1.3622 1.4455 1.8560 1.3830 1.0501 4.7971 4.0569 1.4942 1.0396 1.3145 1.3440 1.3460 1.2468 1.3890 3.4410 5.0629 3.3318 1.2857 1.0365 1.1490 3.7761 5.1011 1.0699 1.0621 1.0555 1.1197 1.0331 1.1065 1.1049 1.0983 1.1008
irintensity: 3378.9248 0.0229 1.7962 4.9037 4.1392 2.2451 11.3899 15.1289 16.7209 12.3790 14.3522 25.1643 32.1423 0.5147 64.7270 3.2212 78.8255 2.0169 3.1601 10.4323 0.2442 11.7130 126.8315 15.2698 80.5661 20.3531 28.7535 10.0463 11.9462 14.5809 24.3488 106.2264 3.7052 169.8150 821.0412 170.7799 231.1390 39.4651 11.0623 8.2297 1.6774 0.1835
temp: 298.150 k
press: 1.00000 atm
elementType: 6 6 1 6 7 7 5 1 1 1 1 1 1 1 6 1
symmnumber: 1
zpe: 331302.6 jmol-1
zpe.correction: 0.126186 hartree
zpe.thermalcorrener: 0.133141 hartree
zpe.thermalcorrenthalpy: 0.134086 hartree
zpe.thermalcorrgfe: 0.095227 hartree
zpe.sumelectzpe: -291.978630 hartree
zpe.sumelectthermal: -291.971675 hartree
zpe.sumelectthermalent: -291.970731 hartree
zpe.sumelectthermalfe: -292.009590 hartree
dipole: 6.1847 3.5696 -1.6765
dipole: 7.3351
quadrupole: -53.7745 -51.1950 -47.6277
quadrupole: -12.0273 5.2022 0.8220
quadrupole: -2.9087 -0.3293 3.2380 -12.0273 5.2022 0.8220
hfenergy: -292.1048168 hartree
pointgroup: C01 [X(C4H9B1N2)]
dipole: 2.4332536 1.4043933 -0.659605 debye
dipolederiv: 0.7147118 0.0901554 -0.0307517 0.1150781 0.2133903 0.0252195 -0.0424251 0.0252174 0.2375537 0.0552596 -0.1150849 0.0716891 0.2538019 -0.0223622 -0.0642084 -0.1285721 -0.0788938 -0.1221233 0.0309787 0.043766 -0.0306453 0.0281282 0.0903618 0.0650781 -0.0220017 0.0656434 0.1727604 -0.0646407 0.1506457 -0.0771137 -0.0792977 -0.1841527 0.0139116 0.0467045 0.0227038 -0.1638578 -1.0279058 -0.1938655 0.0701335 -0.2188842 -0.0311904 -0.0832881 0.0836618 -0.0821958 -0.1214612 -1.3875754 -0.5187082 0.2359487 -0.4229948 -0.6057585 0.1615877 0.1840188 0.1581076 -0.3540957 0.3975258 -0.1580613 0.0812749 -0.0128004 0.6883384 -0.1031002 0.0033774 -0.108783 0.5575958 1.1814157 0.8582121 -0.4214689 0.781089 0.7503425 -0.3059543 -0.3800742 -0.3030927 0.2753508 -0.2765062 -0.0369318 0.0091072 -0.2213347 -0.562324 0.2956951 0.1084413 0.3024604 -0.1564901 -0.064875 -0.018375 0.0259594 0.0756949 -0.007808 -0.0834526 0.0707447 -0.0640188 0.0458903 0.0242923 0.0422597 -0.0264487 -0.0536304 -0.0394664 0.0779589 0.0258612 0.0824428 0.0665066 -0.0565496 -0.0358724 0.0010692 -0.0217465 0.094796 0.0053657 -0.1028592 -0.0182919 -0.066372 -0.1918592 -0.0056634 0.0595032 -0.0461922 -0.1603622 0.0187134 0.1722372 0.0827652 -0.4114975 -0.1811662 -0.0390134 -0.0255727 -0.1590439 -0.3879687 -0.0747743 -0.0515836 -0.131936 -0.1953305 0.7723681 -0.0146653 0.0356375 0.0203335 0.0962078 -0.0114652 0.0172404 -0.0123524 0.0795067 0.0745262 -0.0487978 0.0216784 -0.0382009 0.0679562 0.0627132 0.0152287 0.0602238 0.1560637 unknown
polarizability: 110.3760168|13.0409307|89.9868407|-5.0953738|-14.7320374|69.4654828 unknown
InChI: InChI=1/C4H9BN2/c1-7-2-4(5)6-3-7/h2-3,6H,1,5H3
charge 0 multiplicity 1
16 atoms
C  1.64822276 -0.09559493 -0.04965149
C  -0.28481681 -1.55878673 0.66163328
H  0.36244687 -2.30608341 1.09007276
C  -1.64391492 -1.47445436 0.56212952
N  0.23783059 -0.42138872 0.06943013
N  -1.92626364 -0.28594941 -0.08964014
B  -3.02462142 -2.20523209 0.90093561
H  -3.24700579 -0.64132217 0.05038056
H  -3.89680714 -1.26905907 0.36375937
H  2.16212958 -0.86329197 -0.62933827
H  1.75030308 0.86193038 -0.55831944
H  2.10021852 -0.02251137 0.94018166
H  -3.37191318 -2.2260472 2.05648629
H  -3.30168842 -3.19039635 0.2613306
C  -0.79050583 0.32255594 -0.37249141
H  -0.66940927 1.26759824 -0.87775725
