program: Gaussian 16
title: h_xanthene
version: ES64L-G16RevC.02
method: RwB97XD
basis: GenECP
operation: Freq
keyword: #N
keyword: Geom=AllCheck
keyword: Guess=TCheck
keyword: SCRF=Check
keyword: GenChk
keyword: RwB97XD/GenECP
keyword: Freq
converged: YES YES YES YES
title: Mulliken charges:
elementType: C C C C C C H H H C O C H H H C H H H C C C C C H C H H B N C H H H C H H H H H H H
charge: 0.425421 -0.337528 -0.683874 -0.159295 0.290312 -0.204543 0.234390 0.223458 0.173590 0.060990 -0.080694 -0.483947 0.162421 0.174119 0.190682 -0.812683 0.187961 0.184407 0.201889 0.238558 -0.274811 0.186136 0.253651 -0.588762 0.193327 -0.595385 0.248873 0.184948 -0.357063 0.110705 -0.383567 0.197510 0.213861 0.228265 -0.423826 0.196145 0.187015 0.223277 -0.060658 0.320506 -0.028034 -0.017748
chargesum: -0.00000
title: Mulliken charges with hydrogens summed into heavy atoms:
elementType: C C C C C C C O C C C C C C C C B N C C
charge: 0.425421 -0.103138 -0.460416 0.014295 0.290312 -0.204543 0.060990 -0.080694 0.043274 -0.238425 0.238558 -0.274811 0.379463 0.253651 -0.339889 -0.410436 -0.463503 0.431211 0.256069 0.182611
chargesum: 0.00000
1716.lowfreq: -951.8513 -12.7895 -7.2432 -2.5856 -0.0008 -0.0006 -0.0005 56.8913 71.5854
frequency: -951.8465 56.4159 71.4932 105.4591 116.2533 155.5348 161.6466 178.4956 191.4092 221.5999 234.7762 250.6856 280.9600 292.1365 296.5961 297.8849 308.4787 314.1128 335.2136 358.4817 393.6036 405.9318 435.1419 452.1734 495.2691 515.6816 529.5585 550.7079 560.3195 587.5639 594.4277 605.1867 626.0678 662.9456 680.5854 720.0503 747.9529 770.1042 785.6225 802.0782 826.4220 843.0791 854.4824 877.4474 888.0772 907.8447 929.9144 941.4935 956.1738 977.0142 1001.3312 1004.1785 1011.4122 1021.0044 1028.2179 1064.1809 1094.4145 1101.4053 1104.6568 1144.1057 1154.9076 1169.2816 1179.8051 1189.0286 1194.9892 1201.4014 1207.0538 1221.9484 1243.0307 1252.1335 1278.7177 1286.9160 1292.8301 1298.4805 1320.3835 1334.5523 1351.5222 1384.2943 1403.7449 1423.5256 1443.4150 1463.3758 1473.1679 1485.4223 1486.6215 1488.3952 1490.9399 1504.5090 1506.2788 1507.6100 1513.9005 1519.0059 1523.4113 1530.7807 1589.3246 1640.8957 1662.7587 1670.3882 1688.1483 2057.8802 2478.9620 2522.7044 3043.0553 3044.3615 3049.1580 3049.7913 3119.4181 3126.0918 3129.5881 3131.8554 3134.2751 3141.6065 3160.5869 3176.4188 3181.0622 3193.2579 3198.7475 3211.0009 3213.7245 3223.3360
redmass: 1.1380 3.3556 3.7195 3.4622 2.9280 2.6129 3.1773 3.1450 1.2911 2.5298 2.1595 1.1976 1.1494 3.0411 2.6810 2.4489 1.1120 2.5300 2.9462 3.9345 4.5943 2.8828 3.2021 4.1121 3.9682 3.5388 4.2717 3.3896 2.8681 3.8080 3.5338 3.9239 2.2268 2.8770 5.0787 2.8742 1.7920 1.6238 1.6256 1.8742 3.3861 3.5364 3.6913 2.5572 3.0451 3.7787 1.4277 1.4438 1.7306 2.1238 1.3267 1.3284 1.9586 1.2805 1.3292 1.5572 1.5083 1.6152 1.9466 1.9561 1.2696 2.1344 1.4608 2.0135 1.3736 1.3576 1.5586 2.0673 2.9379 2.7506 2.1152 2.0911 3.0649 2.3248 2.1993 5.4838 5.5377 1.4488 1.2452 1.2294 1.1544 3.0804 1.1792 1.1190 1.0514 1.0458 1.1018 1.3887 1.0614 1.1510 1.5277 1.3250 1.9039 2.5615 1.0596 5.9693 7.0973 8.0958 8.2551 1.0484 1.0552 1.1197 1.0355 1.0383 1.0375 1.0361 1.1033 1.1017 1.1017 1.1032 1.1003 1.1017 1.1052 1.0870 1.1036 1.0921 1.0872 1.0948 1.0921 1.0964
irintensity: 5098.2245 1.8210 2.1685 5.0451 4.6893 5.1418 0.4645 0.7164 2.0217 0.5848 2.5493 0.4776 0.0997 0.6683 0.7092 0.0667 0.0361 1.4113 0.9821 0.9618 4.2988 2.2996 8.7120 0.7516 3.7324 6.2960 10.9267 1.6035 8.5813 2.6235 5.1230 1.8394 15.8287 6.3601 3.1927 0.3946 8.7291 34.3667 66.3444 16.4039 19.1481 3.0009 11.8201 18.7850 4.8050 17.1106 0.1850 0.1937 2.8604 16.1545 2.1563 2.0371 63.4117 37.0612 0.2925 14.2468 18.9557 8.1715 16.9870 17.5518 17.0233 4.4036 19.0344 8.2487 24.1137 11.7732 26.3690 21.3966 86.8131 18.2604 63.4549 12.3011 84.4235 42.4244 50.4546 7.8377 18.3758 11.8280 11.7035 8.6981 9.0734 226.5254 1.3117 26.9105 2.6274 3.4661 10.9732 10.0818 19.1779 42.6169 6.8262 12.1157 12.1007 94.7372 66.4942 8.7057 4.6033 4.1936 2.7059 2529.5937 227.5297 222.5657 34.3376 30.4172 51.5488 21.3106 14.8422 45.9588 11.2992 26.7773 19.3985 19.6431 11.1204 6.0091 3.5656 27.4563 2.5461 24.6364 11.1540 11.5918
temp: 298.150 k
press: 1.00000 atm
elementType: 6 6 6 6 6 6 1 1 1 6 8 6 1 1 1 6 1 1 1 6 6 6 6 6 1 6 1 1 5 7 6 1 1 1 6 1 1 1 1 1 1 1
symmnumber: 1
zpe: 920462.1 jmol-1
zpe.correction: 0.350585 hartree
zpe.thermalcorrener: 0.368372 hartree
zpe.thermalcorrenthalpy: 0.369316 hartree
zpe.thermalcorrgfe: 0.307302 hartree
zpe.sumelectzpe: -815.418415 hartree
zpe.sumelectthermal: -815.400629 hartree
zpe.sumelectthermalent: -815.399685 hartree
zpe.sumelectthermalfe: -815.461699 hartree
dipole: 2.1376 6.7307 -0.6494
dipole: 7.0917
quadrupole: -115.3900 -111.1963 -123.6871
quadrupole: -15.6740 1.4711 -1.6894
quadrupole: 1.3678 5.5615 -6.9293 -15.6740 1.4711 -1.6894
hfenergy: -815.7690007 hartree
pointgroup: C01 [X(C17H22B1N1O1)]
dipole: 0.8409804 2.6480442 -0.2554761 debye
polarizability: 291.7866222|-0.9682958|306.0899204|9.4026952|0.4581299|185.0794407 unknown
InChI: InChI=1/C17H21BNO.H/c1-17(2)11-7-5-9-13(18)15(11)20-16-12(17)8-6-10-14(16)19(3)4;/h5-10H,1-4,18H3;
charge 0 multiplicity 1
42 atoms
C  -0.98506891 -1.97501447 0.0275352
C  -0.58660011 -3.20714985 -0.50175231
C  0.75359048 -3.58694407 -0.52252384
C  1.74892079 -2.72708798 -0.06125821
C  1.40374396 -1.49208259 0.48228964
C  0.04555109 -1.20873738 0.55259224
H  -1.3345553 -3.86580451 -0.932388
H  1.0348996 -4.54739102 -0.94114928
H  2.78855109 -3.02109386 -0.1466191
C  2.37494594 -0.39830386 0.95030031
O  -0.32614323 0.02068289 1.07533917
C  3.78565952 -0.6152956 0.40330943
H  4.45846298 0.17202959 0.75195682
H  4.1917832 -1.56283195 0.76386857
H  3.79808506 -0.62673404 -0.68954226
C  2.43067851 -0.3882628 2.49468599
H  2.82237774 -1.34242069 2.85697996
H  3.08750267 0.41394704 2.84309921
H  1.44049763 -0.23859816 2.92875531
C  1.77905615 0.92877728 0.46359765
C  0.39733335 1.04122051 0.54839081
C  2.46628923 2.00068394 -0.09843961
C  -0.32223826 2.1054163 0.01775346
C  1.77489968 3.1163478 -0.5642165
H  3.54499193 1.96988961 -0.19341493
C  0.38439368 3.17114758 -0.52662063
H  2.32557413 3.9452696 -0.99301666
H  -0.13207748 4.02555016 -0.94616141
B  -2.46386604 -1.35938052 -0.03484497
N  -1.76045777 1.95675121 -0.00558408
C  -2.39064055 2.16435714 1.31276214
H  -2.30608754 3.21222529 1.61760812
H  -3.44319067 1.88655808 1.24004658
H  -1.91071316 1.5195911 2.04508614
C  -2.43632169 2.73191585 -1.05155949
H  -3.47253366 2.39427894 -1.10603318
H  -2.42699142 3.80466329 -0.83670708
H  -1.95354532 2.54509063 -2.01082631
H  -2.32213038 -0.15896606 -0.78989988
H  -2.06076227 0.61275154 -0.34499402
H  -2.95673054 -1.01166867 1.01144446
H  -3.22382009 -1.91380231 -0.79369346
