program: Gaussian 16
title: Me_iPr-TS1
version: ES64L-G16RevC.01
method: RwB97XD
basis: GenECP
operation: Freq
keyword: #N
keyword: Geom=AllCheck
keyword: Guess=TCheck
keyword: SCRF=Check
keyword: GenChk
keyword: RwB97XD/GenECP
keyword: Freq
converged: YES YES YES YES
title: Mulliken charges:
elementType: H C C C C H C H C H B C H H H C H H H N H H C C C H H H H H H C C C H H H H H H H H
charge: 0.226522 -0.458438 -0.163429 -0.611685 0.539716 0.240558 -0.123535 0.224016 0.053529 0.205342 -0.799943 -0.329352 0.177362 0.179083 0.144432 -0.366972 0.164466 0.183223 0.158833 0.137086 0.202511 0.049488 -0.081653 -0.611662 -0.606383 0.183097 0.151669 0.166830 0.180747 0.135506 0.189660 0.008255 -0.547719 -0.600471 0.175591 0.174409 0.187352 0.162552 0.157737 0.160359 0.170252 0.211059
chargesum: -0.00000
title: Mulliken charges with hydrogens summed into heavy atoms:
elementType: C C C C C C B C C N C C C C C C
charge: -0.231916 0.077128 -0.387669 0.539716 0.081807 0.053529 -0.547945 0.171526 0.139550 0.137086 0.088599 -0.110066 -0.100469 0.219314 -0.010367 -0.119824
1716.lowfreq: -277.5842 -7.7182 -3.7758 -0.0003 0.0004 0.0007 4.7659 49.2143 58.0736
frequency: -277.5838 49.2027 58.0431 64.2193 86.9269 92.1687 128.8776 133.3023 147.1489 201.3465 223.3952 234.5800 238.7872 241.3438 249.4907 253.5098 261.8969 272.6717 299.5675 319.5606 350.6486 357.3683 395.0259 401.4537 433.1310 472.7756 496.0529 536.1132 551.0326 563.1338 585.7063 631.4091 647.2784 713.4352 768.8866 770.7685 777.3793 810.3311 863.8535 878.3017 905.4887 932.5717 937.0518 940.7370 979.7748 981.6725 985.9007 986.4181 1015.7868 1018.9855 1029.5943 1062.8235 1069.7750 1073.7660 1087.3594 1113.4129 1121.4523 1128.6252 1145.1795 1179.8709 1189.5222 1193.0468 1202.3057 1208.7349 1234.1627 1254.6847 1291.5269 1297.0872 1317.9048 1322.3314 1329.3251 1342.1236 1354.3989 1397.1074 1403.6049 1415.8263 1420.2072 1446.0291 1470.6407 1477.3438 1482.6067 1487.5906 1488.3777 1494.7846 1496.0750 1498.2282 1501.9592 1505.1916 1507.7137 1509.0494 1510.3125 1518.6767 1533.6633 1636.6721 1667.0836 2978.2283 2981.5662 2985.3813 3016.8535 3020.5777 3021.0384 3023.4540 3028.0558 3079.7022 3079.9930 3080.2895 3084.1222 3089.5797 3092.5000 3100.1309 3102.6217 3109.0324 3110.1608 3129.4076 3140.6858 3172.6337 3182.3835 3193.5364 3208.0563 3812.0364
redmass: 1.3293 3.4560 3.5764 2.5082 2.6232 2.7343 3.1662 3.2299 3.0342 2.2954 2.3737 1.2195 1.2232 1.0886 1.2981 1.2519 1.1043 1.6260 1.8700 2.7938 2.6863 3.1439 2.3229 2.1030 2.6651 2.8269 2.5180 2.5310 1.3582 2.7027 3.1570 1.5023 3.5966 2.6072 1.4755 1.1221 4.4746 2.4422 3.0153 2.5317 1.4653 1.2259 1.1884 1.9140 2.9766 1.4414 1.3964 1.3831 2.0071 1.4474 1.2866 1.1327 1.9908 1.4998 1.9163 2.2689 1.3229 2.1069 2.0031 1.6955 1.1997 1.7698 1.6195 1.7299 2.6354 4.0551 1.8503 1.7795 2.0456 1.9942 1.6076 2.7050 1.4220 1.2405 1.2484 1.2238 1.2256 1.1560 1.3317 1.6859 1.0467 1.0544 1.0435 1.0476 1.0493 1.0506 1.0583 1.0448 1.0537 1.0587 1.0433 1.1232 2.2933 6.2297 5.8263 1.0520 1.0520 1.0801 1.0386 1.0369 1.0375 1.0428 1.0728 1.0823 1.0997 1.0837 1.1001 1.1017 1.1012 1.1020 1.1010 1.1007 1.0996 1.1030 1.1015 1.0864 1.0879 1.0932 1.0989 1.0087
irintensity: 208.5562 0.1223 0.5907 0.1351 0.7190 0.9118 0.2370 0.5117 0.0458 4.3081 1.2272 0.6732 0.1536 0.2201 0.0230 0.7939 0.3368 0.5221 1.8280 0.4229 2.1229 0.5955 1.7671 1.0601 0.9535 2.0992 13.3777 11.0603 5.9289 1.9557 9.9910 111.5691 2.8232 16.5400 56.7971 9.4803 2.7701 11.1039 9.8179 9.7751 1.2500 1.2345 0.8507 36.6298 35.8980 10.5684 0.6064 0.4575 47.1641 5.9540 7.5958 6.6553 3.4734 14.7592 4.7901 6.3701 2.4484 14.7607 2.5585 8.3915 0.9544 1.2371 9.6962 5.1977 28.7156 27.9413 4.2752 2.5356 7.9481 14.5500 10.5203 22.0277 8.6527 4.7144 5.8454 7.3397 4.1697 0.1907 6.4894 8.5075 6.0895 2.4917 3.0110 3.7874 16.6157 5.6781 17.4578 4.1219 11.6449 11.1291 23.5472 7.5069 50.3613 9.4101 4.8517 63.4117 156.9841 20.3318 41.0443 73.7552 38.4749 55.9145 27.8352 57.1711 22.0387 20.4673 89.3330 33.2828 82.2772 30.3228 65.5548 45.5521 45.2184 21.8475 21.2725 9.0930 2.6842 30.1239 27.3154 711.3857
temp: 298.150 k
press: 1.00000 atm
elementType: 1 6 6 6 6 1 6 1 6 1 5 6 1 1 1 6 1 1 1 7 1 1 6 6 6 1 1 1 1 1 1 6 6 6 1 1 1 1 1 1 1 1
symmnumber: 1
zpe: 977853.3 jmol-1
zpe.correction: 0.372445 hartree
zpe.thermalcorrener: 0.391173 hartree
zpe.thermalcorrenthalpy: 0.392117 hartree
zpe.thermalcorrgfe: 0.327343 hartree
zpe.sumelectzpe: -628.318872 hartree
zpe.sumelectthermal: -628.300144 hartree
zpe.sumelectthermalent: -628.299200 hartree
zpe.sumelectthermalfe: -628.363974 hartree
dipole: 0.7723 -1.6876 0.6764
dipole: 1.9753
quadrupole: -92.4583 -103.8084 -107.6369
quadrupole: -8.8503 4.5670 -0.6493
quadrupole: 8.8429 -2.5072 -6.3357 -8.8503 4.5670 -0.6493
hfenergy: -628.6913168 hartree
pointgroup: C01 [X(C14H26B1N1)]
dipole: 0.3038579 -0.6639407 0.2661154 debye
polarizability: 222.9308595|6.191879|240.844191|5.5087171|-8.5774972|185.4586642 unknown
InChI: InChI=1/C14H24BN.2H/c1-11(2)15(12(3)4)13-9-7-8-10-14(13)16(5)6;;/h7-12H,1-6H3;;
charge 0 multiplicity 1
42 atoms
H  0.23212888 0.90731062 -0.577648
C  1.27346231 0.65531469 -0.40855968
C  2.24289531 1.6483149 -0.44883312
C  1.6426564 -0.65891608 -0.14656305
C  3.60508662 1.37572555 -0.24596096
H  1.93022092 2.66929195 -0.64738478
C  2.97940103 -0.95525574 0.07521367
H  0.89603244 -1.44441224 -0.10831955
C  3.95132616 0.04446897 0.02105232
H  3.27400861 -1.97668595 0.29443845
B  4.6012805 2.61929478 -0.38638955
C  5.87730172 -1.3136813 -0.59231135
H  5.64892353 -1.07454288 -1.63170414
H  6.96412235 -1.34509469 -0.47473626
H  5.48274767 -2.3174899 -0.36905372
C  5.59198622 -0.54604514 1.68551958
H  5.10418241 -1.4678186 2.03939292
H  6.66980087 -0.64277436 1.84376129
H  5.22667276 0.28941853 2.28688903
N  5.33370977 -0.27889115 0.27581772
H  6.15537196 2.28277302 0.24856882
H  5.9770316 1.5259443 0.1783627
C  5.12202378 2.97380699 -1.86362598
C  4.01524067 3.73287895 -2.61619182
C  5.57311336 1.75727533 -2.67631609
H  3.13695462 3.09659804 -2.76826448
H  3.6903936 4.62766991 -2.07570034
H  4.36371259 4.04971939 -3.60499897
H  5.91799734 2.0497441 -3.67435613
H  6.39389591 1.22731938 -2.18254567
H  4.75019443 1.04547989 -2.80373812
C  4.41272015 3.78618882 0.70074125
C  4.34273803 3.27178984 2.14378545
C  5.41275244 4.94115012 0.5892226
H  5.31190935 2.86273915 2.45479805
H  4.09009319 4.0747201 2.84441469
H  3.5975945 2.47925894 2.25468192
H  5.20542744 5.72080932 1.33008141
H  6.4377329 4.59109417 0.7658821
H  5.39266709 5.40827072 -0.39886202
H  5.97866904 3.65495537 -1.77746532
H  3.4166612 4.19201722 0.45695925
