program: Gaussian 16
title: MeQHBiPr TS1
version: ES64L-G16RevC.01
method: RwB97XD
basis: GenECP
operation: Freq
keyword: #N
keyword: Geom=AllCheck
keyword: Guess=TCheck
keyword: SCRF=Check
keyword: GenChk
keyword: RwB97XD/GenECP
keyword: Freq
converged: YES YES NO YES
title: Mulliken charges:
elementType: C C H C N N N B H H H H H C C C H H H H H H C C C H H H H H H H H
charge: -0.367402 -0.204611 0.276840 -0.697207 0.331341 -0.215592 0.115455 0.159262 0.309602 -0.139624 0.214450 0.217075 0.202542 0.178189 -0.735124 -0.656818 0.151913 0.162771 0.155375 0.147182 0.151339 0.154099 0.039859 -0.565711 -0.669425 0.167622 0.145368 0.147756 0.151048 0.159811 0.167850 0.163899 0.180866
chargesum: -0.00000
title: Mulliken charges with hydrogens summed into heavy atoms:
elementType: C C C N N N B C C C C C C
charge: 0.266664 0.072230 -0.697207 0.331341 -0.215592 0.425058 0.019638 0.342088 -0.265065 -0.204199 0.220725 -0.104966 -0.190716
1716.lowfreq: -1354.3661 -8.0204 -4.0604 -3.5722 -0.0006 -0.0004 -0.0001 42.1573 48.1207
frequency: -1354.3661 42.0173 48.0750 54.8064 75.9486 91.4591 132.3004 145.0113 191.6214 231.6078 237.5586 240.9183 249.6378 274.1440 285.9327 318.5156 334.4429 373.1432 403.2334 434.3970 464.7714 518.9718 666.8518 682.8690 719.5158 737.8612 762.0064 826.8944 868.1164 879.8238 927.6551 931.5402 937.9974 980.4920 982.6900 1017.5931 1030.5827 1056.5940 1072.1596 1082.0349 1092.2732 1106.8761 1139.1643 1153.3375 1168.0759 1185.3336 1194.5139 1198.6595 1207.4701 1288.7682 1314.1389 1323.8503 1332.4565 1336.2041 1349.0878 1394.6522 1398.2793 1400.8261 1412.7284 1415.5364 1451.0499 1474.9001 1485.0339 1486.6038 1487.3014 1494.2372 1495.7989 1502.2193 1504.7960 1505.8961 1506.9652 1514.1822 1590.2197 1743.9739 1864.7368 2980.4070 3010.4842 3012.7831 3014.5892 3016.4421 3020.8318 3071.9360 3075.1517 3077.7630 3078.8814 3080.2287 3090.4050 3094.5396 3098.9608 3102.5551 3164.8798 3194.7185 3296.8215
redmass: 1.0975 1.0811 3.1650 2.5795 2.5847 4.6450 2.8489 3.0001 3.0706 1.1374 1.1842 1.2941 1.2581 1.7582 1.9423 3.0053 3.6663 2.5646 2.2252 2.6835 2.8507 3.0512 3.8293 2.9731 1.8981 4.4228 2.1427 1.4275 2.8746 2.4295 1.1813 1.1775 2.1984 1.3692 1.4205 2.5571 1.3861 2.1150 2.0003 2.6843 2.3848 2.3767 2.0806 1.3294 1.6886 1.6263 1.7171 1.7758 1.0606 1.7373 2.0500 4.8520 1.3614 2.9841 1.4417 1.2502 3.2456 1.4107 1.2294 1.2343 1.5775 2.1612 1.0455 1.0486 1.0402 1.0454 1.0476 1.0529 1.0509 1.0461 1.0420 1.2600 4.9990 1.1039 1.0684 1.0808 1.0367 1.0363 1.0365 1.0389 1.0796 1.1011 1.1020 1.1009 1.0997 1.0343 1.1010 1.1002 1.0995 1.0991 1.1069 1.1052 1.1010
irintensity: 3917.2285 0.0202 1.4202 0.6587 0.2034 5.2322 1.7716 0.1144 0.5237 0.1204 0.0108 0.5638 0.6057 1.0403 0.2185 1.1107 0.3920 1.1631 0.6462 0.3796 0.1200 0.8683 6.5402 11.6217 8.3546 10.1526 48.2556 29.9167 28.4019 11.5771 1.7178 0.1950 46.3218 3.8073 1.3126 45.7114 9.7170 41.6579 12.1170 9.9728 8.7961 19.8849 7.8200 1.7265 4.5504 134.5319 17.3943 1.8815 21.0727 1.9551 26.3859 11.6091 2.7330 49.6428 12.9899 4.7709 6.3151 10.2729 8.9638 0.8212 10.6501 18.3593 0.2147 0.5252 17.1830 3.9485 5.5329 12.0398 6.8033 14.2085 13.6242 3.5483 5.7598 495.5172 110.0486 34.2212 55.7732 62.4390 96.1733 27.2660 35.5457 36.8454 1.7792 122.7992 123.3038 16.1306 48.7023 62.5734 61.0542 50.5831 5.8730 0.6971 1.7457
temp: 298.150 k
press: 1.00000 atm
elementType: 6 6 1 6 7 7 7 5 1 1 1 1 1 6 6 6 1 1 1 1 1 1 6 6 6 1 1 1 1 1 1 1 1
symmnumber: 1
zpe: 749546.1 jmol-1
zpe.correction: 0.285487 hartree
zpe.thermalcorrener: 0.300769 hartree
zpe.thermalcorrenthalpy: 0.301713 hartree
zpe.thermalcorrgfe: 0.242754 hartree
zpe.sumelectzpe: -543.722572 hartree
zpe.sumelectthermal: -543.707290 hartree
zpe.sumelectthermalent: -543.706346 hartree
zpe.sumelectthermalfe: -543.765305 hartree
dipole: 6.1922 0.3601 -0.6437
dipole: 6.2360
quadrupole: -91.7603 -90.1415 -89.7761
quadrupole: -9.6774 3.9598 0.7396
quadrupole: -1.2010 0.4178 0.7832 -9.6774 3.9598 0.7396
hfenergy: -544.0080588 hartree
pointgroup: C01 [X(C9H20B1N3)]
dipole: 2.4361945 0.141668 -0.2532501 debye
polarizability: 183.3086022|17.5026513|165.0160225|-12.6621784|-6.1125015|149.0170173 unknown
InChI: InChI=1/C9H20BN3/c1-7(2)10(8(3)4)9-6-13(5)12-11-9/h6-8,10-11H,1-5H3
charge 0 multiplicity 1
33 atoms
C  1.69639299 -0.21044988 -0.16027651
C  -0.23938438 -1.68050493 0.53860935
H  0.38249654 -2.52342879 0.78818539
C  -1.59706305 -1.47546325 0.58065873
N  0.29537533 -0.5156923 0.0799866
N  -0.63273822 0.39006578 -0.16366538
N  -1.75301474 -0.20018723 0.14081203
B  -3.05351078 -2.08642427 0.91011708
H  -3.04873214 -0.26640649 0.27580998
H  -3.77292734 -0.90741004 0.56556258
H  2.07813924 -0.83912723 -0.96453214
H  1.76262579 0.83629591 -0.44686034
H  2.26819345 -0.38145299 0.75124508
C  -3.57936331 -3.19176925 -0.14375888
C  -3.36581259 -2.79363829 -1.60744442
C  -2.91156795 -4.54523461 0.1400463
H  -3.84061039 -1.83335131 -1.8349464
H  -2.29828856 -2.6924238 -1.83696257
H  -3.77839862 -3.54080386 -2.29544233
H  -3.1221538 -4.89768934 1.15435684
H  -3.25223263 -5.31790596 -0.55909339
H  -1.8214169 -4.47231584 0.03551219
C  -3.37858287 -2.29228752 2.47899661
C  -4.83260959 -2.70016841 2.73798279
C  -3.01317492 -1.0726754 3.33304204
H  -5.52198939 -1.93147517 2.3676601
H  -5.08925871 -3.63781368 2.23695073
H  -5.03121743 -2.83041724 3.80822467
H  -3.20090169 -1.2509998 4.39817354
H  -1.95940222 -0.79804012 3.22252855
H  -3.61046568 -0.20155439 3.03693789
H  -4.65945297 -3.31927744 0.00769881
H  -2.73735623 -3.1255385 2.8101929
