program: Gaussian 16
title: H_Me-TS1
version: ES64L-G16RevC.01
method: RwB97XD
basis: GenECP
operation: Freq
keyword: #N
keyword: Geom=AllCheck
keyword: Guess=TCheck
keyword: SCRF=Check
keyword: GenChk
keyword: RwB97XD/GenECP
keyword: Freq
converged: YES YES YES YES
title: Mulliken charges:
elementType: H C C C C H C H C H B N H H C H H H C H H H H H
charge: 0.221071 -0.344256 -0.024038 -0.401627 0.861924 0.200485 -0.343286 0.214548 -0.658937 0.211135 -0.244088 -0.323955 0.045507 0.191701 -0.559564 0.126854 0.130013 0.164335 -0.559196 0.145114 0.139194 0.152412 0.307050 0.347603
chargesum: -0.00000
title: Mulliken charges with hydrogens summed into heavy atoms:
elementType: C C C C C C B N C C
charge: -0.123184 0.176447 -0.187079 0.861924 -0.132151 -0.658937 -0.198581 0.522399 -0.138361 -0.122476
1716.lowfreq: -845.9365 -8.0131 -0.0007 -0.0006 -0.0005 10.2654 12.1755 66.5342 101.2595
frequency: -845.9364 66.3922 101.2477 186.7723 203.6280 210.8574 230.8421 258.0524 315.5801 391.9069 440.2518 452.6329 471.5976 516.6150 551.3562 575.0592 689.8432 719.7765 756.9054 769.0295 802.6230 827.7636 847.7487 884.6635 894.7032 965.1448 978.7298 992.3184 1018.5652 1034.3054 1068.3692 1083.7687 1131.9171 1151.9171 1184.6316 1202.1249 1213.1841 1250.4253 1307.0352 1323.6025 1329.0557 1333.8017 1377.5755 1466.9058 1473.0234 1479.5570 1481.9481 1489.3836 1517.7703 1619.9055 1647.1886 1678.6687 1760.6630 2106.8935 3007.5244 3011.6204 3072.0116 3075.3353 3083.4894 3092.5465 3174.4608 3180.4068 3192.9814 3209.5119 3536.2233 3616.7605
redmass: 1.1588 2.6143 3.2109 1.3880 1.5910 1.1956 2.2243 2.3574 2.9943 1.2888 2.4933 2.8185 2.6127 3.1367 3.2358 5.0063 3.3891 1.2505 3.1340 1.2230 2.2219 1.5731 2.9889 1.2888 1.3447 1.4223 1.4086 1.5955 1.3198 2.7114 2.1499 3.1384 1.8985 1.3471 1.1590 1.4529 1.7202 2.7648 1.6413 1.5291 1.8293 1.5514 1.0915 1.0521 1.0535 1.0883 1.1553 1.8306 2.5628 1.5166 2.9439 4.2425 1.0415 1.0398 1.0368 1.0377 1.0988 1.0968 1.1001 1.1010 1.0865 1.0900 1.0933 1.0983 1.0498 1.0948
irintensity: 2481.2212 1.0704 0.6569 1.7224 4.1852 1.1510 4.0693 4.0944 2.2306 10.9050 13.2757 15.3996 4.4549 36.3928 4.0281 0.7405 0.4341 4.2702 0.2178 76.6539 1.6120 2.4131 3.6980 0.6871 1.5968 10.7105 7.4809 167.1672 0.3788 68.0818 6.9886 41.2288 5.0605 4.5089 2.5440 23.7322 16.0426 23.5237 15.3720 37.2119 47.2227 10.4742 22.8580 0.1031 2.5959 8.0694 10.5968 4.6843 25.0766 53.7692 9.9190 10.2437 199.4598 1246.2090 51.4433 27.2521 58.1049 41.8311 66.7057 68.3840 9.9710 3.3211 31.0074 22.8153 23.1398 37.5380
temp: 298.150 k
press: 1.00000 atm
elementType: 1 6 6 6 6 1 6 1 6 1 5 7 1 1 6 1 1 1 6 1 1 1 1 1
symmnumber: 1
zpe: 532859.2 jmol-1
zpe.correction: 0.202955 hartree
zpe.thermalcorrener: 0.213230 hartree
zpe.thermalcorrenthalpy: 0.214174 hartree
zpe.thermalcorrgfe: 0.167947 hartree
zpe.sumelectzpe: -392.629226 hartree
zpe.sumelectthermal: -392.618951 hartree
zpe.sumelectthermalent: -392.618007 hartree
zpe.sumelectthermalfe: -392.664234 hartree
dipole: 2.1182 -4.7109 0.4217
dipole: 5.1824
quadrupole: -38.1161 -73.1948 -68.3103
quadrupole: -22.8835 2.2601 0.0439
quadrupole: 21.7577 -13.3211 -8.4366 -22.8835 2.2601 0.0439
hfenergy: -392.8321815 hartree
pointgroup: C01 [X(C8H14B1N1)]
dipole: 0.83337 -1.8534205 0.1659236 debye
dipolederiv: -0.1371958 0.0067977 0.0162002 0.0169945 0.078095 0.0065702 0.01356 0.0080964 0.1517737 0.0952074 -0.0183024 -0.0124456 -0.0587957 0.0254039 -0.0176301 -0.0060243 -0.0276764 -0.1392191 -0.0040973 -0.2056727 0.0125569 -0.0909055 0.0489468 -0.0047022 -0.0116572 -0.018574 -0.1538648 -0.0814757 0.0471348 -0.0059408 0.0525947 -0.034063 -0.0174463 -0.0090505 -0.0113563 -0.1826445 -0.2710837 0.1104292 -0.0279303 0.1635011 -0.2122482 -0.0264152 -0.0344939 -0.0103188 -0.1817527 0.0542512 0.0716155 0.0048545 0.1048038 -0.0769043 0.0165309 0.0017555 0.0211299 0.1270813 -0.0361877 -0.0617639 -0.0048218 -0.0466702 0.0232074 -0.0187055 0.0247432 -0.010343 -0.1339393 0.0109531 -0.0972234 0.0191064 -0.0979696 -0.0528593 0.0276827 0.0139536 0.0319909 0.1546251 0.6666487 0.0609381 -0.0535151 -0.2441508 0.0467062 0.023562 -0.0575182 0.0100798 -0.0865008 0.0290793 0.0983584 -0.0053745 0.0785166 -0.0744866 0.0192576 -0.002133 0.0145069 0.155946 0.7948349 -0.2554936 0.0413843 -0.0155021 0.7052245 -0.0360783 0.1021117 -0.1853704 0.7286365 -0.675368 -0.0814278 0.0374972 0.0937982 -1.2219435 -0.0585988 0.0896969 -0.1774421 -0.0686588 -0.3365134 0.275715 -0.1267964 0.1280862 -0.6767301 0.0840324 -0.1307239 0.082123 -0.1062211 0.0487095 -0.0115224 -0.0427879 -0.1409551 1.8157564 0.019449 -0.0581225 0.239945 0.0159561 -0.1158837 -0.0212732 0.0883465 -0.0489739 -0.1231627 0.0859974 0.0499194 0.0673462 -0.4022879 -0.09502 -0.1773228 0.0603185 -0.1719025 -0.1134667 0.0596377 0.0524425 0.0605313 0.0472192 0.0225646 0.073903 0.0710357 0.1087827 -0.1295333 -0.1619401 0.0404682 -0.1165821 -0.0201343 -0.0849088 0.0833604 -0.1318939 0.0585841 0.0395134 0.049979 -0.0958045 0.0618885 -0.0042028 -0.1196494 0.1930992 0.0655675 0.0665285 -0.3843146 -0.1675798 0.0330481 -0.0775099 -0.1569501 -0.0558188 -0.1907879 -0.0072383 -0.154513 -0.1327263 -0.0012789 0.0064203 0.0058015 0.0720169 -0.1231376 0.1419035 -0.0732453 0.0909027 -0.0039133 0.0294507 -0.0813972 0.0215401 0.0320956 0.0552215 -0.0051851 0.0599209 -0.00516 0.0765887 0.052789 0.0587983 0.0104755 -0.2198385 0.1933576 -0.0357328 0.0424485 0.0411061 0.139081 0.0464136 0.0144171 0.0046593 0.2006552 0.1655121 -0.0015466 -0.0272472 0.0712991 0.2378286 -0.0109772 -0.0144093 -0.0049413 0.1702092 unknown
polarizability: 148.4714608|6.6623378|165.6120043|-6.7754651|-6.5198654|98.7263838 unknown
InChI: InChI=1/C8H13BN.H/c1-9(2)7-5-3-4-6-8(7)10;/h3-6,9H,10H2,1-2H3;
charge 0 multiplicity 1
24 atoms
H  0.32510864 0.44124719 0.25800842
C  1.403101 0.33024529 0.20762798
C  2.20984119 1.4523623 0.05482608
C  1.97245245 -0.93640381 0.3082295
C  3.60339052 1.35203313 -0.01564507
H  1.74634962 2.43273866 -0.00244945
C  3.35318907 -1.07398685 0.24259613
H  1.34582033 -1.81169446 0.43649059
C  4.13467615 0.06178346 0.0706546
H  3.8151017 -2.05356998 0.3185514
B  4.58878743 2.61640521 -0.197336
N  5.58214201 -0.00061761 0.010618
H  5.77761388 2.28669239 0.42381834
H  5.78550926 1.36981305 0.24869725
C  5.0111331 2.89094242 -1.73440237
H  5.77336934 3.67317271 -1.82660543
H  5.38219015 2.00243415 -2.2610436
H  4.13004504 3.23346868 -2.29164279
C  4.19112949 3.92107869 0.66183456
H  4.9538714 4.70584529 0.60898415
H  3.26807985 4.35664457 0.25614019
H  4.00250836 3.7047772 1.71915723
H  5.98428455 -0.65118103 0.67667289
H  5.92413551 -0.23241875 -0.91679797
