program: Gaussian 16
title: Pip_Me-TS1
version: ES64L-G16RevC.01
method: RwB97XD
basis: GenECP
operation: Freq
keyword: #N
keyword: Geom=AllCheck
keyword: Guess=TCheck
keyword: SCRF=Check
keyword: GenChk
keyword: RwB97XD/GenECP
keyword: Freq
converged: YES YES YES YES
title: Mulliken charges:
elementType: H C C C C H C H H B H H C H H H C H H H C N C C C H H C H H C H H H H H H
charge: 0.216400 -0.412799 -0.396738 -0.448507 0.349249 0.202344 -0.141415 0.230147 0.191711 -0.373424 0.162978 0.108047 -0.552648 0.137870 0.123072 0.170045 -0.562378 0.159682 0.149576 0.164921 0.158819 0.133285 -0.155653 -0.246245 -0.419858 0.222904 0.172346 -0.351048 0.192856 0.198949 -0.508896 0.217917 0.163295 0.220632 0.165038 0.216466 0.141060
chargesum: -0.00000
title: Mulliken charges with hydrogens summed into heavy atoms:
elementType: C C C C C B C C C N C C C C C
charge: -0.196398 -0.194394 -0.218360 0.349249 0.050296 -0.210446 -0.121661 -0.088199 0.158819 0.241332 0.239597 0.145560 -0.038646 0.034622 -0.151370
1716.lowfreq: -352.9021 -5.5791 -4.8737 -0.0006 -0.0005 -0.0004 9.5653 52.7814 66.4584
frequency: -352.9013 52.7440 66.4293 81.0712 91.6757 116.0867 181.5193 206.1652 214.2305 233.2286 240.7448 262.7792 276.1056 302.9891 349.7076 377.6794 459.0843 466.5772 491.6711 510.2732 515.6346 528.6262 574.6728 644.4604 660.0612 694.9143 767.1280 776.9318 795.4901 805.0795 822.1995 828.2845 858.2599 867.0133 883.9043 897.9883 898.8992 932.7676 957.4155 979.1735 983.1123 990.3346 1017.7950 1040.9404 1051.6939 1063.8544 1079.6632 1080.7906 1092.3290 1124.1125 1140.6736 1161.8761 1176.1437 1187.3099 1201.3525 1214.9855 1257.8664 1271.5461 1296.6242 1302.5606 1311.7363 1321.3388 1330.8842 1334.8983 1359.1303 1361.0163 1393.9050 1395.3521 1397.0150 1427.6929 1465.3873 1471.1385 1477.4203 1481.3090 1484.0173 1487.6408 1489.0152 1497.8687 1501.2473 1516.1519 1522.3342 1570.1250 1638.2884 1670.1666 2828.8932 2982.1611 2992.4642 3015.5111 3017.5877 3032.5175 3045.1246 3046.1133 3080.8349 3084.6940 3094.0156 3095.7917 3099.2643 3100.2749 3103.2037 3104.7500 3117.2083 3170.7141 3182.3153 3192.3941 3207.7111
redmass: 1.3228 2.8320 2.8596 3.1883 3.1446 3.4336 1.1131 1.2317 1.9795 2.0318 2.5958 2.1567 2.6055 3.3139 3.3278 1.7261 2.7348 2.8486 2.6697 2.5598 2.5409 2.2920 3.3848 2.6785 1.4227 3.0813 1.5748 3.0903 2.3037 1.6248 1.5983 1.4622 2.8590 1.3610 1.3756 1.4206 1.4715 2.0859 2.6612 1.3997 1.4558 1.4148 1.3151 2.7283 2.5003 1.9395 1.8651 1.9874 1.6356 1.7337 1.8417 1.5491 2.1070 1.1600 1.3163 2.4621 2.2513 2.1582 1.2632 1.6410 1.2706 3.3117 1.3422 1.2796 1.3480 1.4949 1.4984 1.4636 1.4032 1.5277 1.0528 1.0556 1.0691 1.2891 1.0982 1.5741 1.0867 1.1095 1.0830 1.1036 2.5571 1.0544 6.1475 5.9856 1.0182 1.0717 1.0694 1.0374 1.0370 1.0679 1.0636 1.0632 1.0974 1.0976 1.1003 1.0954 1.1012 1.0995 1.0963 1.1014 1.0919 1.0869 1.0880 1.0934 1.0986
irintensity: 1292.6738 0.5652 0.6662 2.2063 6.0879 0.6432 3.4368 2.4357 18.3324 39.1207 0.9288 9.7923 0.0706 0.9060 1.7161 24.8183 27.9202 9.2074 16.3422 17.4391 3.4639 21.6555 4.9346 3.6598 25.9460 5.6633 54.0581 3.7443 16.7538 9.7939 5.9554 1.1383 2.4426 0.3249 4.3764 0.3142 85.3453 3.3500 6.4958 0.6383 4.8892 5.5562 0.1562 43.6932 11.9895 10.3264 1.7644 15.5152 17.4504 27.9509 13.7497 2.7153 10.2819 0.9224 0.2037 38.9207 25.2228 16.0702 0.2673 16.2525 10.6285 16.5680 53.8893 21.2469 7.1005 22.7875 0.6993 7.7205 1.1113 9.5319 0.5427 1.4460 5.3408 18.8041 5.4299 3.4540 10.0270 27.8688 4.8794 13.6511 36.9700 168.1052 8.2606 9.1748 1936.2070 21.2405 19.4467 33.3040 19.7450 31.3194 22.8945 38.3152 16.7597 64.6323 58.8827 59.7892 62.4290 53.3432 8.3740 65.3336 18.9818 12.1567 1.7657 34.8230 26.9727
temp: 298.150 k
press: 1.00000 atm
elementType: 1 6 6 6 6 1 6 1 1 5 1 1 6 1 1 1 6 1 1 1 6 7 6 6 6 1 1 6 1 1 6 1 1 1 1 1 1
symmnumber: 1
zpe: 854754.9 jmol-1
zpe.correction: 0.325559 hartree
zpe.thermalcorrener: 0.340403 hartree
zpe.thermalcorrenthalpy: 0.341347 hartree
zpe.thermalcorrgfe: 0.284357 hartree
zpe.sumelectzpe: -587.858102 hartree
zpe.sumelectthermal: -587.843258 hartree
zpe.sumelectthermalent: -587.842314 hartree
zpe.sumelectthermalfe: -587.899303 hartree
dipole: 2.4368 -3.3678 0.8861
dipole: 4.2503
quadrupole: -64.2744 -100.4544 -97.7516
quadrupole: -16.4308 5.8290 -0.1834
quadrupole: 23.2190 -12.9609 -10.2581 -16.4308 5.8290 -0.1834
hfenergy: -588.1836605 hartree
pointgroup: C01 [X(C13H22B1N1)]
dipole: 0.9587276 -1.324983 0.3486216 debye
polarizability: 225.4649795|-6.141345|218.9132789|-1.4773595|-12.1921052|157.6855253 unknown
InChI: InChI=1/C13H21BN.H/c1-14(2)12-8-4-5-9-13(12)15-10-6-3-7-11-15;/h4-5,8-9,14H,3,6-7,10-11H2,1-2H3;
charge 0 multiplicity 1
37 atoms
H  0.35950952 0.51817587 0.10577855
C  1.43422651 0.37557878 0.14530998
C  2.28564464 1.45670311 -0.04904905
C  1.95804969 -0.88879001 0.39694575
C  3.67769414 1.3163396 -0.00885775
H  1.85649244 2.43721152 -0.23437829
C  3.3349463 -1.06038855 0.44664537
H  1.29862799 -1.73543575 0.55235355
H  3.75367729 -2.04291871 0.63976388
B  4.64919555 2.57255831 -0.27000089
H  5.91963061 2.32851226 0.35352769
H  5.8436226 1.48454622 0.26360298
C  5.05944664 2.80806164 -1.80909687
H  5.80342482 3.60310321 -1.93205584
H  5.44142361 1.90998694 -2.30669561
H  4.16502285 3.1166236 -2.36497043
C  4.30782847 3.89111373 0.58823507
H  5.06552215 4.67520977 0.48424253
H  3.36650189 4.31616587 0.21591631
H  4.16491266 3.69218821 1.65545447
C  4.17430782 0.03093668 0.23994298
N  5.61072845 -0.10473777 0.2703812
C  6.14691224 -0.6614692 1.51897262
C  6.15747735 -0.77455305 -0.91906628
C  7.66486738 -0.51871869 1.54935563
H  5.68706975 -0.12047143 2.34929287
H  5.87065821 -1.72259669 1.61999119
C  7.67365414 -0.63343314 -0.95788138
H  5.69754503 -0.32069338 -1.79851874
H  5.87657486 -1.84018907 -0.91095003
C  8.30193901 -1.17606582 0.32538292
H  8.04808088 -0.96181073 2.47245299
H  7.92182527 0.54654447 1.5708283
H  8.06151948 -1.15990067 -1.83404375
H  7.92787427 0.42614241 -1.07712692
H  9.38257646 -1.01139897 0.32262736
H  8.14411516 -2.26092198 0.37403638
