program: Gaussian 16
title: Pyrr_Me-TS1 restart
version: ES64L-G16RevC.01
method: RwB97XD
basis: GenECP
operation: Freq
keyword: #N
keyword: Geom=AllCheck
keyword: Guess=TCheck
keyword: SCRF=Check
keyword: GenChk
keyword: RwB97XD/GenECP
keyword: Freq
converged: YES YES YES YES
title: Mulliken charges:
elementType: H C C C C H C H C H B H H C H H H C H H H N C C C H H C H H H H H H
charge: 0.214226 -0.395833 -0.359995 -0.566875 0.333069 0.207153 -0.147027 0.229381 0.241588 0.189735 -0.350381 0.165226 0.096716 -0.563629 0.135689 0.130320 0.170463 -0.580464 0.156599 0.150367 0.160054 0.196836 -0.201434 -0.278415 -0.480698 0.161384 0.217692 -0.334335 0.163390 0.189745 0.178558 0.190368 0.183407 0.197120
chargesum: -0.00000
title: Mulliken charges with hydrogens summed into heavy atoms:
elementType: C C C C C C B C C N C C C C
charge: -0.181607 -0.152842 -0.337494 0.333069 0.042707 0.241588 -0.185154 -0.127157 -0.113444 0.293552 0.177642 0.074720 -0.111772 0.046192
chargesum: 0.00000
1716.lowfreq: -319.7439 -6.9643 -0.0007 -0.0007 -0.0005 3.4996 9.6601 40.3119 57.7487
frequency: -319.7432 40.2187 57.7317 71.5810 87.9591 101.3921 120.2074 185.5414 207.7703 217.5670 238.6010 261.8739 287.3477 344.7188 350.8818 461.0998 503.2486 519.4155 523.8589 571.1480 641.3937 653.4927 665.7249 702.1565 766.5728 767.4098 794.7797 800.9306 820.3900 863.5976 871.1297 873.2505 887.0907 899.9760 917.4804 973.7392 981.1842 990.2611 992.2665 1005.1733 1017.7092 1044.5713 1070.2195 1078.1650 1084.0294 1111.4591 1134.2116 1149.4326 1186.8302 1194.0828 1214.5248 1232.3693 1243.6259 1250.3354 1281.4994 1298.1390 1315.5220 1320.7862 1328.8093 1330.7638 1334.3498 1341.5255 1372.3504 1399.5400 1465.2988 1470.8973 1476.8142 1481.2195 1487.8811 1491.7589 1509.9438 1514.7476 1523.0908 1531.9850 1552.1350 1638.4363 1670.4767 2862.0350 3005.8189 3015.3639 3015.8172 3017.8265 3077.2833 3081.2533 3084.4789 3087.8719 3094.3305 3099.6178 3104.6763 3116.9371 3124.0626 3141.4714 3170.6522 3181.4040 3192.1259 3207.7551
redmass: 1.3681 1.8167 2.3222 2.9081 2.8062 2.9068 3.4130 1.1178 1.1083 2.4090 2.1499 2.8153 2.3959 3.5940 3.2788 2.8016 3.0554 2.9178 2.4321 3.3880 1.4867 2.8088 2.4340 3.5324 1.4862 1.5361 2.2400 1.5978 1.5580 1.3693 1.5072 2.4954 1.5117 1.4267 2.6632 1.5432 1.6258 1.7764 1.7203 2.5845 1.3150 2.5025 2.0509 1.9862 1.9315 1.7042 1.8157 1.7375 1.1623 2.4785 2.5629 1.4523 1.2687 1.5762 1.2194 1.7232 2.1402 3.4413 1.3379 1.3442 1.2886 1.4208 1.4065 1.4764 1.0525 1.0541 1.0633 1.2745 1.6315 1.0787 1.0914 1.0904 2.5282 1.1127 1.0605 6.2107 5.9961 1.0179 1.0705 1.0393 1.0638 1.0393 1.0622 1.0976 1.0972 1.0649 1.1008 1.1013 1.0934 1.0961 1.1031 1.1062 1.0869 1.0880 1.0933 1.0985
irintensity: 1211.9387 0.0509 2.4571 0.1646 0.5000 10.9133 1.7856 4.8537 1.2429 13.6945 33.0075 26.2785 21.8744 19.7596 22.9978 27.9402 13.1277 11.8508 39.5901 4.3076 1.2526 1.6465 23.6554 7.1744 6.3011 49.2390 14.5321 16.5640 9.0175 8.7695 3.5465 31.4188 53.9170 1.3283 6.2950 4.8565 6.4151 3.4226 2.1017 6.0719 0.1747 40.8983 11.2241 5.4963 10.0638 21.9283 11.0534 16.1733 1.0972 4.9309 37.4773 8.6021 6.4979 7.8397 9.4670 14.2096 32.0856 8.0579 26.1456 32.3516 19.7872 39.5877 1.7735 7.2170 0.5650 1.9582 4.8974 19.2864 4.5977 1.5167 20.3814 3.6580 46.9312 11.8604 134.5583 7.9110 8.4159 1983.4711 30.4671 25.0881 24.5620 18.9949 21.6788 14.1086 65.3050 47.2737 58.8695 62.4989 37.4276 13.9733 3.6491 54.8740 12.8758 2.1903 33.3241 26.7887
temp: 298.150 k
press: 1.00000 atm
elementType: 1 6 6 6 6 1 6 1 6 1 5 1 1 6 1 1 1 6 1 1 1 7 6 6 6 1 1 6 1 1 1 1 1 1
symmnumber: 1
zpe: 776678.4 jmol-1
zpe.correction: 0.295821 hartree
zpe.thermalcorrener: 0.310096 hartree
zpe.thermalcorrenthalpy: 0.311040 hartree
zpe.thermalcorrgfe: 0.254373 hartree
zpe.sumelectzpe: -548.565754 hartree
zpe.sumelectthermal: -548.551479 hartree
zpe.sumelectthermalent: -548.550535 hartree
zpe.sumelectthermalfe: -548.607202 hartree
dipole: 2.3708 -3.4340 0.8818
dipole: 4.2650
quadrupole: -58.5403 -93.1550 -91.8489
quadrupole: -16.9174 5.7646 -0.2708
quadrupole: 22.6411 -11.9736 -10.6675 -16.9174 5.7646 -0.2708
hfenergy: -548.8615751 hartree
pointgroup: C01 [X(C12H20B1N1)]
dipole: 0.9327573 -1.3510207 0.3469187 debye
polarizability: 209.7730929|-4.5611594|206.8567444|-1.1149349|-12.1054538|145.1017499 unknown
InChI: InChI=1/C12H19BN.H/c1-13(2)11-7-3-4-8-12(11)14-9-5-6-10-14;/h3-4,7-8,13H,5-6,9-10H2,1-2H3;
charge 0 multiplicity 1
34 atoms
H  0.37708405 0.55541241 0.08924279
C  1.45122166 0.40918173 0.13073397
C  2.3066 1.48758968 -0.05821938
C  1.97056186 -0.85828292 0.37797129
C  3.69836383 1.3421822 -0.01483951
H  1.88148993 2.46990565 -0.24333902
C  3.34619704 -1.03420462 0.43088083
H  1.30811273 -1.70350813 0.52798475
C  4.19086037 0.05515593 0.23201893
H  3.76027881 -2.01950153 0.62052933
B  4.66829632 2.59702037 -0.28424211
H  5.96427135 2.34572623 0.29740626
H  5.87346043 1.50371028 0.23431625
C  5.03538172 2.84205021 -1.83217814
H  5.7976834 3.61651515 -1.9724279
H  5.37051408 1.93799361 -2.35218399
H  4.13149979 3.18408524 -2.35223209
C  4.35767163 3.90733703 0.59697796
H  5.11188907 4.69221358 0.47512179
H  3.40443178 4.33572486 0.26058997
H  4.25038202 3.69813079 1.66637593
N  5.62373164 -0.08577201 0.27022457
C  6.21335238 -0.6723287 1.47839298
C  6.23928133 -0.80442101 -0.85304627
C  7.69331178 -0.82463084 1.10988158
H  5.7626557 -1.64923848 1.70103122
H  6.03746886 -0.01597212 2.33338323
C  7.70952331 -0.92192199 -0.43767124
H  6.08526935 -0.25074837 -1.78047399
H  5.77909689 -1.79641629 -0.96719306
H  8.25909161 0.04729918 1.4430681
H  8.13175787 -1.70147261 1.58790996
H  8.29260126 -0.10488608 -0.86616621
H  8.14595513 -1.85670241 -0.79174279
