program: Gaussian 16
title: me_dibenzofuran_ts1
version: ES64L-G16RevC.02
frameworkgroup: C1[X(C16H20BNO)]
method: RwB97XD
basis: GenECP
operation: Freq
keyword: #N
keyword: Geom=AllCheck
keyword: Guess=TCheck
keyword: SCRF=Check
keyword: GenChk
keyword: RwB97XD/GenECP
keyword: Freq
converged: YES YES YES YES
title: Mulliken charges:
elementType: C C O C C C C C H C H H C H C H C C H B N C H H H C H H H C H H H C H H H H H
charge: -1.121484 0.844224 0.035421 0.731943 -0.720517 -0.065091 0.015193 -0.303337 0.229847 -0.584770 0.240418 0.205861 -0.293898 0.217026 -0.345938 0.218729 0.006269 0.406375 0.223114 -0.376771 0.020360 -0.663463 0.171049 0.135079 0.150184 -0.632566 0.131418 0.153643 0.178019 -0.313119 0.211752 0.218639 0.231161 -0.422352 0.192462 0.198018 0.234523 -0.152809 0.395386
chargesum: -0.00000
title: Mulliken charges with hydrogens summed into heavy atoms:
elementType: C C O C C C C C C C C C C B N C C C C
charge: -1.121484 0.844224 0.035421 0.731943 -0.720517 0.164756 0.015193 -0.062919 -0.378908 -0.076872 -0.127208 0.229383 0.406375 0.018615 -0.132448 -0.207151 -0.169486 0.348435 0.202651
chargesum: 0.00000
1716.lowfreq: -1467.5654 -9.6774 -7.6978 -0.0006 -0.0004 -0.0001 5.8838 62.8924 96.2484
frequency: -1467.5654 62.8778 96.2365 105.9433 126.1211 142.0122 147.2061 175.4529 191.7183 196.7564 208.1628 220.1749 248.0645 261.9564 272.5984 293.7102 311.6503 324.3654 373.9665 392.3239 412.4482 428.9998 465.2207 510.9071 547.8275 558.4605 575.0195 591.1790 612.3470 612.4669 649.1122 685.0060 727.2815 737.2562 759.7326 782.3302 796.7783 801.5913 815.9621 833.8639 850.2401 867.8917 897.0911 900.8550 910.0889 920.5969 950.2081 975.9812 991.5812 994.1973 999.6296 1059.7189 1068.0467 1072.5721 1084.1098 1102.0654 1117.7111 1150.8110 1184.9599 1188.7270 1200.2093 1215.0731 1222.3551 1248.3883 1268.7492 1298.4198 1305.1708 1321.6194 1323.1629 1325.1497 1342.2656 1370.4439 1435.1109 1444.6031 1452.7025 1465.9475 1469.7440 1474.5077 1479.5903 1481.7210 1483.5865 1490.9053 1499.2751 1508.6929 1512.1441 1519.1872 1527.6212 1531.8304 1573.5218 1635.3066 1649.2601 1655.9629 1693.1861 3002.8476 3007.1887 3056.5390 3058.9431 3066.6933 3069.9463 3090.4675 3095.6565 3142.6227 3145.5921 3168.0790 3175.0457 3188.6717 3191.6967 3198.8205 3207.9212 3211.8335 3221.0778
redmass: 1.1236 3.5930 2.6069 4.0857 3.6095 2.9674 2.7534 2.5825 1.6645 1.2001 1.4885 1.1411 2.1627 1.2420 3.4503 3.2895 3.6842 2.9489 4.1215 3.0121 3.8751 3.8160 3.3778 3.1754 3.5045 4.5361 5.1917 4.1710 3.9285 4.4190 4.8816 5.9559 4.0332 1.2120 1.7789 1.5897 3.0793 1.7767 2.6977 1.6453 1.3856 3.6188 5.4349 4.0672 1.5534 1.4249 1.1828 2.0385 2.0402 1.4552 1.3497 2.4730 1.7887 2.1146 1.8850 2.3802 1.3725 2.7557 1.3791 1.3306 1.5515 2.0979 3.5876 3.2252 1.8591 2.3569 2.2872 1.4754 1.3544 2.8066 3.7316 3.9277 2.1385 1.3078 1.1701 1.0699 1.0548 1.0563 1.7222 1.3609 1.0738 1.0713 1.1687 1.0800 1.1099 2.1509 1.7956 1.5597 1.1492 6.9628 6.8471 7.6520 8.8192 1.0400 1.0385 1.0349 1.0367 1.0950 1.0960 1.1011 1.0990 1.1031 1.1041 1.1060 1.0873 1.1031 1.0910 1.0873 1.0961 1.0925 1.0966
irintensity: 9154.9240 1.0832 0.8867 6.3538 0.2050 3.0714 1.8527 2.4945 0.8170 0.8644 1.0587 1.6595 1.6099 1.8626 0.2573 0.9266 1.9986 3.3958 0.5311 5.2061 4.8966 8.3839 8.5846 16.3328 1.7566 0.1036 12.9733 6.6769 2.0780 6.1930 2.8732 2.1693 5.8070 9.7167 13.1047 82.4573 16.8920 5.2223 27.6045 6.8180 8.6063 16.9816 12.0217 6.5288 5.3591 4.6900 9.2373 38.0258 21.9861 7.3988 3.5487 23.3266 24.8799 14.6010 56.2557 35.2500 8.9974 65.8799 11.8878 20.3244 33.8376 5.9890 16.1154 86.8885 20.2711 52.9218 61.8684 56.0404 51.8840 20.3273 52.9312 5.4550 30.9173 164.2469 12.0305 8.6563 0.7043 1.5707 22.2400 50.0047 1.5374 22.8655 63.3240 35.2423 12.2012 25.9583 0.4708 131.4006 478.0746 21.2107 21.0548 8.8515 29.2209 33.9335 57.0762 14.7719 42.8409 12.6409 88.8682 55.9405 61.9832 9.4625 10.8417 8.9263 5.7675 4.8759 21.3144 3.1455 24.5508 9.8513 10.3951
temp: 298.150 k
press: 1.00000 atm
elementType: 6 6 8 6 6 6 6 6 1 6 1 1 6 1 6 1 6 6 1 5 7 6 1 1 1 6 1 1 1 6 1 1 1 6 1 1 1 1 1
symmnumber: 1
zpe: 843769.4 jmol-1
zpe.correction: 0.321375 hartree
zpe.thermalcorrener: 0.338571 hartree
zpe.thermalcorrenthalpy: 0.339515 hartree
zpe.thermalcorrgfe: 0.278550 hartree
zpe.sumelectzpe: -776.107284 hartree
zpe.sumelectthermal: -776.090088 hartree
zpe.sumelectthermalent: -776.089144 hartree
zpe.sumelectthermalfe: -776.150108 hartree
dipole: 7.8832 0.0045 1.6279
dipole: 8.0495
quadrupole: -108.2139 -107.0159 -119.9706
quadrupole: -14.3645 3.3107 2.6846
quadrupole: 3.5195 4.7176 -8.2371 -14.3645 3.3107 2.6846
hfenergy: -776.4286584 hartree
pointgroup: C01 [X(C16H20B1N1O1)]
dipole: -2.0213687 2.4378895 -0.0096577 debye
polarizability: 205.7290379|-66.6892145|294.0053323|9.6974185|2.3189805|275.9930494 unknown
InChI: InChI=1/C16H19BNO.H/c1-17(2)13-9-5-7-11-12-8-6-10-14(18(3)4)16(12)19-15(11)13;/h5-10,18H,1-4H3;
charge 0 multiplicity 1
39 atoms
C  2.787685 2.62031633 -0.11239002
C  2.41051136 2.8311488 -1.4450465
O  2.64754599 3.76901827 0.62101099
C  1.69362626 4.12482671 -1.42098768
C  1.77489972 4.50593587 -0.08092852
C  0.72392394 4.7686069 -2.18985096
C  0.77779314 5.15952975 0.60938086
C  -0.16649914 5.63455046 -1.55094976
H  0.59493007 4.54218078 -3.24159561
C  -0.20177887 5.78250835 -0.15626711
H  -0.9307541 6.12789408 -2.13985303
H  -1.02519109 6.31515252 0.30370408
C  2.42901232 1.71614619 -2.28082438
H  2.16216874 1.78513835 -3.32918365
C  2.70062277 0.47679642 -1.69758774
H  2.70567944 -0.40666675 -2.32705546
C  2.82339342 0.32212783 -0.30852454
C  2.82626257 1.41973072 0.5652489
H  2.83892302 -0.68463973 0.09851308
B  2.49016458 1.48060984 2.16221772
N  0.74535726 4.82171443 2.02737579
C  3.63043082 2.09776823 3.11490554
H  4.0431167 3.04191171 2.74520111
H  3.27020945 2.2623661 4.13754242
H  4.46714078 1.38869196 3.18309004
C  1.72707378 0.18001553 2.7178799
H  2.42184911 -0.67238861 2.73024844
H  1.37636793 0.31290629 3.74747691
H  0.86908991 -0.11872225 2.10528222
C  1.72944542 5.5687204 2.84017436
H  1.44873781 6.62319905 2.90260014
H  1.75348882 5.13092951 3.83886225
H  2.71413699 5.46828673 2.38926571
C  -0.59932761 4.87449594 2.61921006
H  -0.54587271 4.44087723 3.61821717
H  -0.96182955 5.90302203 2.69372986
H  -1.28231761 4.28359269 2.00985997
H  1.13620106 3.53337339 2.12398092
H  1.4166535 2.52920795 2.23047952
