program: Gaussian 16
title: Me_Me-TS1
version: ES64L-G16RevC.01
method: RwB97XD
basis: GenECP
operation: Freq
keyword: #N
keyword: Geom=AllCheck
keyword: Guess=TCheck
keyword: SCRF=Check
keyword: GenChk
keyword: RwB97XD/GenECP
keyword: Freq
converged: YES YES YES YES
title: Mulliken charges:
elementType: H C C C C H C H C H B C H H H C H H H N H H C H H H C H H H
charge: 0.216032 -0.355572 -0.418130 -0.456891 0.375362 0.207745 -0.213738 0.226576 0.164008 0.193775 -0.247498 -0.371527 0.173739 0.183286 0.171372 -0.372214 0.159956 0.179390 0.198191 -0.028620 0.078760 0.222463 -0.590055 0.129935 0.120741 0.169835 -0.578075 0.150101 0.153943 0.157109
chargesum: -0.00000
title: Mulliken charges with hydrogens summed into heavy atoms:
elementType: C C C C C C B C C N C C
charge: -0.139540 -0.210385 -0.230314 0.375362 -0.019963 0.164008 -0.168739 0.156870 0.165323 0.193843 -0.169543 -0.116922
1716.lowfreq: -325.5621 -13.9064 -5.0802 -0.0004 -0.0003 -0.0001 8.1627 51.6665 66.6908
frequency: -325.5600 51.6487 66.6192 96.3121 135.6416 184.0805 198.0123 210.3414 217.2378 222.3028 242.2137 266.2172 279.3984 344.4719 361.8324 461.8256 494.9824 514.0838 527.0162 578.2002 583.4042 642.9028 685.4235 766.8416 774.3286 803.4421 805.6298 820.9669 865.7672 884.6962 900.9171 975.8554 981.7833 987.2846 1018.0536 1043.8168 1062.5145 1071.5398 1076.5750 1103.3573 1130.7523 1160.2492 1184.2002 1188.4799 1206.0996 1214.4735 1260.3547 1298.7856 1320.8262 1331.3046 1335.0530 1338.5678 1445.4460 1464.6913 1469.8490 1472.4082 1475.8273 1481.4440 1483.6171 1486.8005 1496.0201 1501.0160 1515.1035 1525.7279 1559.1159 1638.3519 1670.3466 2853.3365 3007.8119 3015.3905 3017.0050 3018.1519 3081.3929 3084.4380 3093.8326 3096.1647 3097.5542 3098.8889 3141.8685 3149.1788 3170.7465 3181.7354 3192.4642 3208.2698
redmass: 1.3730 2.5373 2.8275 2.9113 3.0812 1.0944 1.3264 1.1828 1.4057 1.7056 1.3978 2.8798 2.2827 2.5085 3.1969 2.6143 3.0778 2.9843 2.5536 4.0939 3.2446 1.1775 3.4353 1.5882 3.6755 2.2581 1.6349 1.5816 1.3300 1.3779 1.4552 1.6329 1.6087 2.1045 1.3164 2.5025 1.7167 1.6767 1.8717 1.6102 1.9653 1.2819 1.5102 1.2582 1.5487 2.8248 3.3216 1.6523 5.0010 1.3435 1.3098 2.4527 1.1585 1.0531 1.1321 1.1376 1.0658 1.3420 1.0496 1.3530 1.0487 1.0655 1.2038 2.0893 1.0609 6.2182 5.9628 1.0171 1.0446 1.0372 1.0413 1.0404 1.0977 1.0972 1.1005 1.0931 1.0903 1.1013 1.1038 1.1026 1.0871 1.0881 1.0932 1.0985
irintensity: 1165.6483 1.8763 0.1993 0.2102 1.3348 1.3038 19.5477 35.2176 22.6388 1.4996 25.0900 14.1413 1.9856 29.8378 1.0139 49.3518 18.2393 16.8305 34.1822 7.3119 9.7657 8.0181 5.7110 57.5710 2.7480 12.8893 16.7271 11.6198 2.1157 77.6674 1.7013 11.8264 4.6538 13.2182 0.2280 39.6656 5.0676 26.4528 6.2477 30.4368 10.0953 9.3688 13.3690 7.5738 30.3295 20.1506 18.5715 10.4225 23.6518 53.9422 16.1432 17.1516 1.7653 0.7506 8.4882 7.2318 2.1219 7.9485 5.6738 0.4019 12.3753 29.3020 3.4566 53.8108 133.6927 7.0028 6.2120 2012.5427 33.4841 36.9248 4.8291 20.2499 14.8821 60.7571 62.8167 19.5059 52.8372 63.8031 18.2576 21.4692 12.5387 2.0365 32.0079 25.2871
temp: 298.150 k
press: 1.00000 atm
elementType: 1 6 6 6 6 1 6 1 6 1 5 6 1 1 1 6 1 1 1 7 1 1 6 1 1 1 6 1 1 1
symmnumber: 1
zpe: 678705.4 jmol-1
zpe.correction: 0.258505 hartree
zpe.thermalcorrener: 0.271870 hartree
zpe.thermalcorrenthalpy: 0.272814 hartree
zpe.thermalcorrgfe: 0.219489 hartree
zpe.sumelectzpe: -471.183738 hartree
zpe.sumelectthermal: -471.170373 hartree
zpe.sumelectthermalent: -471.169429 hartree
zpe.sumelectthermalfe: -471.222754 hartree
dipole: 2.0111 -3.3452 0.6459
dipole: 3.9562
quadrupole: -51.7844 -82.5560 -80.2834
quadrupole: -15.7849 4.0105 -0.0071
quadrupole: 19.7568 -11.0148 -8.7421 -15.7849 4.0105 -0.0071
hfenergy: -471.4422429 hartree
pointgroup: C01 [X(C10H18B1N1)]
dipole: 0.791217 -1.3160939 0.2541346 debye
polarizability: 179.4821281|0.0620341|190.2484257|-2.4810798|-8.9237812|124.799488 unknown
InChI: InChI=1/C10H17BN.H/c1-11(2)9-7-5-6-8-10(9)12(3)4;/h5-8,11H,1-4H3;
charge 0 multiplicity 1
30 atoms
H  0.33681023 0.46691333 0.07050133
C  1.41384192 0.3386525 0.08950296
C  2.24677103 1.44033328 -0.06043063
C  1.95926252 -0.92920835 0.26944215
C  3.64181281 1.31971042 -0.04365977
H  1.80139554 2.42236136 -0.19193645
C  3.33860671 -1.08170719 0.29295723
H  1.31446494 -1.79258049 0.38988012
C  4.15931142 0.03179223 0.13326609
H  3.77363889 -2.06657395 0.43115084
B  4.57884857 2.61051183 -0.25618182
C  6.13756612 -0.68935605 -1.07701605
H  5.72752609 -0.17177666 -1.94475358
H  7.22516802 -0.58351672 -1.08457694
H  5.88580037 -1.75608608 -1.15212973
C  6.14531201 -0.69320493 1.35466469
H  5.90956848 -1.76288676 1.43198081
H  7.23203411 -0.57901898 1.35423576
H  5.73824959 -0.18077345 2.22765062
N  5.60102439 -0.08664632 0.1425657
H  5.90798597 2.34522366 0.23086609
H  5.81464167 1.50324339 0.16026853
C  4.86736454 2.98504661 -1.79488147
H  5.5980511 3.7937625 -1.90683763
H  5.20712519 2.1362329 -2.39825266
H  3.93052413 3.33476556 -2.24714334
C  4.2821451 3.83920254 0.74018308
H  5.01207938 4.65047569 0.64630506
H  3.30402627 4.26755101 0.48505769
H  4.23250239 3.54346689 1.79334287
