program: Gaussian 16
title: me_indenoPy_ts1_scan
version: ES64L-G16RevC.02
method: RwB97XD
basis: GenECP
operation: Freq
keyword: #N
keyword: Geom=AllCheck
keyword: Guess=TCheck
keyword: SCRF=Check
keyword: GenChk
keyword: RwB97XD/GenECP
keyword: Freq
converged: YES YES NO YES
title: Mulliken charges:
elementType: C C C C C C H H H C H H C C C C C H H H N B C H H H C H H H H H
charge: -0.010158 0.121315 0.278562 -0.246175 -0.302595 -0.154902 0.235316 0.222543 0.216595 -0.520985 0.220982 0.225983 -1.002525 0.024783 0.263892 0.351357 -0.558017 0.220886 0.244616 0.238593 0.220280 -0.034585 -0.652068 0.151393 0.187499 0.188182 -0.663386 0.179355 0.149697 0.214996 -0.013658 0.002229
chargesum: 0.00000
title: Mulliken charges with hydrogens summed into heavy atoms:
elementType: C C C C C C C C C C C C N B C C
charge: -0.010158 0.121315 0.278562 -0.010859 -0.080052 0.061693 -0.074020 -1.002525 0.024783 0.484777 0.595972 -0.319424 0.208851 -0.034585 -0.124993 -0.119339
chargesum: -0.00000
1716.lowfreq: -907.1669 -888.4989 -5.2531 -0.0002 -0.0002 -0.0002 7.8079 10.8715 33.7581
frequency: -906.9648 -888.3945 33.7268 69.0580 81.4725 95.0061 98.4104 122.4492 135.8137 151.8368 205.5034 221.1528 237.1273 242.2398 256.9433 261.5770 329.8744 409.6037 415.1862 436.0622 475.6117 496.6488 550.0471 559.4140 566.9884 587.3234 647.6864 658.6217 684.8045 749.6576 776.0286 790.7581 804.0189 806.2345 828.9688 862.6673 872.6119 909.2094 924.2380 937.7488 955.4925 988.5939 1008.2497 1013.7605 1048.1330 1078.0563 1094.2588 1115.3690 1138.7619 1143.7511 1173.1707 1198.1704 1203.9777 1210.5044 1264.1938 1280.7346 1288.2719 1325.1794 1328.2179 1330.7855 1338.1616 1383.1708 1441.8079 1448.6575 1450.1114 1455.5677 1462.9622 1470.5206 1476.2303 1519.7985 1528.7577 1645.4405 1659.4904 1668.3343 1674.9762 3005.5404 3022.4878 3059.1113 3086.6523 3088.4997 3097.9675 3120.3144 3132.9962 3168.5838 3179.1316 3186.3710 3191.9083 3203.0117 3217.9452 4841.1065
redmass: 1.0083 1.0083 2.7601 1.5606 1.5440 2.1056 3.6728 1.4669 1.1172 3.8930 1.1335 2.6444 1.2830 2.1339 2.7666 2.2860 3.9219 3.7595 2.7382 3.7752 2.9247 3.4921 4.0846 3.6386 5.2034 3.3426 5.7871 1.5168 3.5638 3.9259 3.6546 1.2225 1.8513 1.8709 3.7204 5.0294 1.4011 2.2316 1.5819 2.6167 1.6183 1.5337 1.3444 1.4074 6.1249 2.3510 2.5317 2.0908 1.5428 2.7459 1.1426 1.3552 1.4327 2.4581 2.0419 3.5147 2.8598 1.6496 1.9227 1.4958 3.6384 2.9012 1.0842 1.2126 2.1107 1.0959 1.0917 1.5168 1.4728 2.7298 3.3281 7.0518 6.6297 7.4238 7.9103 1.0484 1.0382 1.0608 1.0949 1.0821 1.1024 1.1018 1.1035 1.0879 1.0896 1.0901 1.0916 1.0971 1.0969 1.0078
irintensity: 0.1967 0.7274 0.3191 0.1811 0.1816 1.8907 3.3812 0.8169 0.4286 0.6817 1.6355 1.6677 0.0283 5.9007 2.8089 1.3490 1.7190 2.1871 3.9484 0.2150 1.1463 3.0801 0.0290 0.3092 0.5568 0.2785 6.9445 2.7066 5.8310 9.9296 1.0500 98.5781 5.3201 6.4077 11.4170 3.4741 0.9253 41.0306 3.3817 14.8438 1.0664 0.7585 0.9005 1.7696 3.2098 4.9456 34.6774 17.3261 16.4240 57.6083 0.0418 25.6776 1.4433 13.1725 5.2121 30.3407 33.9033 48.3189 29.3043 144.2793 21.7091 4.4432 3.0047 25.1909 74.4198 0.9343 1.3518 9.0720 22.1244 1.0809 20.7400 23.8732 2.8514 50.9216 44.7654 8.0034 5.5735 15.9833 16.2739 19.0034 5.2860 41.6967 33.3746 13.0322 21.3928 14.1964 14.0604 35.6498 19.4404 24.4156
temp: 298.150 k
press: 1.00000 atm
elementType: 6 6 6 6 6 6 1 1 1 6 1 1 6 6 6 6 6 1 1 1 7 5 6 1 1 1 6 1 1 1 1 1
symmnumber: 1
zpe: 674129.1 jmol-1
zpe.correction: 0.256762 hartree
zpe.thermalcorrener: 0.272642 hartree
zpe.thermalcorrenthalpy: 0.273586 hartree
zpe.thermalcorrgfe: 0.213684 hartree
zpe.sumelectzpe: -622.420082 hartree
zpe.sumelectthermal: -622.404202 hartree
zpe.sumelectthermalent: -622.403258 hartree
zpe.sumelectthermalfe: -622.463160 hartree
dipole: -1.6275 -1.6148 -1.8991
dipole: 2.9771
quadrupole: -99.1977 -87.4196 -96.4425
quadrupole: -7.1806 -1.2683 6.4988
quadrupole: -4.8444 6.9336 -2.0892 -7.1806 -1.2683 6.4988
hfenergy: -622.6768437 hartree
pointgroup: C01 [X(C14H16B1N1)]
dipole: -0.6403232 -0.6353246 -0.7471583 debye
polarizability: 228.8996379|-39.8866904|239.9667754|33.1638227|43.3751087|173.248066 unknown
InChI: InChI=1/C14H14BN.2H/c1-15(2)12-7-3-5-10-9-11-6-4-8-16-14(11)13(10)12;;/h3-8H,9H2,1-2H3;;
charge 0 multiplicity 1
32 atoms
C  0.4494008 0.67939299 -0.35149572
C  1.64241164 0.73250779 0.37512086
C  1.98532575 1.79451733 1.21280002
C  1.05768208 2.83992687 1.27815949
C  -0.13974682 2.8020137 0.56140099
C  -0.45915585 1.72182509 -0.25939252
H  1.26115041 3.70447355 1.90370623
H  -0.83389862 3.63151004 0.64542377
H  -1.39362399 1.70576131 -0.81022486
C  0.3796419 -0.60349216 -1.15317845
H  0.29265006 -0.40926806 -2.22689367
H  -0.48136166 -1.21461326 -0.86419484
C  2.41134875 -0.47492237 0.07979556
C  1.68560608 -1.27713764 -0.81169937
C  4.14131072 -1.92291802 0.16295973
C  2.24570551 -2.47199561 -1.2176989
C  3.50503317 -2.79817721 -0.71062037
H  5.12452802 -2.16324444 0.55677911
H  1.73532001 -3.13747171 -1.90609825
H  3.99470873 -3.7220048 -0.9934605
N  3.61389568 -0.76182243 0.56522782
B  3.32930526 1.77633977 2.0443683
C  3.34946407 1.03805779 3.42909911
H  4.35158389 0.73956042 3.74711507
H  2.98521629 1.76865426 4.16914513
H  2.67494274 0.17984602 3.47844566
C  4.54381409 2.62325801 1.51889276
H  4.22682268 3.63169606 1.22768575
H  5.3837456 2.69426715 2.21426567
H  4.90548688 2.15039083 0.59630089
H  6.53745745 -0.23515662 2.04651534
H  5.8587487 -0.15414864 1.83298915
