program: Gaussian 16
title: MeQHBMe2 TS1
version: ES64L-G16RevC.01
method: RwB97XD
basis: GenECP
operation: Freq
keyword: #N
keyword: Geom=AllCheck
keyword: Guess=TCheck
keyword: SCRF=Check
keyword: GenChk
keyword: RwB97XD/GenECP
keyword: Freq
converged: YES YES YES YES
title: Mulliken charges:
elementType: C C H C N N N B H H H C H H H C H H H H H
charge: -0.390517 -0.187653 0.268574 -0.249596 0.298227 -0.497953 0.152267 -0.044539 0.330180 -0.114849 0.212095 -0.536437 0.140518 0.160939 0.138546 -0.535657 0.161111 0.140275 0.139052 0.212901 0.202516
chargesum: -0.00000
title: Mulliken charges with hydrogens summed into heavy atoms:
elementType: C C C N N N B C C
charge: 0.236995 0.080921 -0.249596 0.298227 -0.497953 0.482447 -0.159389 -0.096434 -0.095219
1716.lowfreq: -1364.3665 -8.5051 0.0007 0.0011 0.0011 6.6865 10.0246 58.2783 76.6085
frequency: -1364.3664 57.6004 76.5842 101.9912 176.4934 178.8446 218.7984 220.5947 254.1782 371.2502 381.4352 496.7483 531.7958 654.0797 685.5984 730.5084 739.8133 818.8767 823.9605 827.6500 869.1577 965.2107 1023.8330 1073.4328 1084.7643 1103.7489 1104.4500 1154.0120 1164.1865 1185.3863 1209.7214 1324.5771 1327.8610 1329.5799 1339.1810 1399.7547 1451.9708 1464.1376 1470.5609 1473.1281 1477.5522 1483.9236 1487.5862 1515.2158 1590.3904 1743.9019 1879.8432 3009.7652 3012.0156 3074.8538 3077.5238 3080.8135 3093.3349 3095.2942 3165.5155 3195.3660 3295.9112
redmass: 1.0972 1.0510 3.2466 3.5781 1.5933 1.0391 1.5625 2.7235 2.2791 2.5268 4.4210 3.6974 2.3982 1.7857 2.0056 3.9391 3.3850 1.3743 2.0925 1.4283 1.3144 1.8217 3.4168 2.1896 2.3101 3.2642 3.1413 1.3307 1.5147 1.6284 1.0307 5.1512 1.3701 1.3139 3.6945 4.6082 1.5857 1.0502 1.0519 1.3919 1.4044 1.0717 1.0405 1.2611 4.9805 1.1032 1.0681 1.0384 1.0382 1.0967 1.0960 1.0331 1.1015 1.1005 1.1069 1.1052 1.1010
irintensity: 4189.4912 0.0173 0.5101 4.7919 0.9452 0.0010 1.4182 0.8456 0.6682 7.7477 0.0901 2.5281 12.9180 7.1920 0.1138 22.6635 1.2066 0.6343 11.1446 32.9993 0.0289 57.1899 123.7131 15.6431 14.6792 48.7881 29.6661 3.0552 26.4507 175.7303 24.6858 28.3672 57.4676 32.7218 67.3914 7.6787 12.9767 0.7279 1.5093 8.7998 8.3211 14.3840 16.8854 4.1170 4.3418 530.0069 141.0374 35.8872 29.3858 19.8760 72.0476 23.5656 27.8070 88.7460 5.9282 0.7429 1.6101
temp: 298.150 k
press: 1.00000 atm
elementType: 6 6 1 6 7 7 7 5 1 1 1 6 1 1 1 6 1 1 1 1 1
symmnumber: 1
zpe: 449462.5 jmol-1
zpe.correction: 0.171191 hartree
zpe.thermalcorrener: 0.181258 hartree
zpe.thermalcorrenthalpy: 0.182202 hartree
zpe.thermalcorrgfe: 0.135649 hartree
zpe.sumelectzpe: -386.589080 hartree
zpe.sumelectthermal: -386.579014 hartree
zpe.sumelectthermalent: -386.578070 hartree
zpe.sumelectthermalfe: -386.624622 hartree
dipole: 6.2927 0.9120 -0.2564
dipole: 6.3636
quadrupole: -65.1494 -63.8291 -61.0797
quadrupole: -10.2811 4.2326 1.1833
quadrupole: -1.7967 -0.4764 2.2730 -10.2811 4.2326 1.1833
hfenergy: -386.7602717 hartree
pointgroup: C01 [X(C5H12B1N3)]
dipole: 2.4757294 0.3588121 -0.1008926 debye
dipolederiv: 0.6104781 0.1177371 -0.0366993 0.1396618 0.2007928 0.0217801 -0.0705362 0.0177148 0.2058841 0.1031585 -0.2306636 0.1290074 0.15601 -0.0580856 -0.0115614 -0.0827928 -0.0253635 -0.0812432 0.0636394 0.0278292 -0.0187021 0.0250379 0.1142467 0.0459706 -0.0160879 0.0458505 0.1755034 -0.1214293 0.2219411 -0.1173983 0.0149718 -0.3069314 0.0846245 -0.0069274 0.0866262 -0.2022066 -0.7437514 -0.2477616 0.1036181 -0.0934151 0.2249547 -0.1556991 0.050359 -0.1516252 0.0193154 0.200881 -0.1778565 0.1040757 -0.0811252 -0.4181471 0.1831978 0.0484393 0.1743176 -0.1558778 -1.1807915 -0.3987484 0.1724951 -0.4644928 -0.1876756 -0.0165962 0.2116231 -0.0086566 -0.1650582 0.5394414 -0.1164287 0.0538976 0.1562814 1.0761548 -0.1543838 -0.0896992 -0.163559 0.8572169 1.373972 0.9334433 -0.4476682 0.7262994 0.6565201 -0.2587062 -0.3414434 -0.2519827 0.2385766 -0.3563038 -0.0257419 0.0040533 -0.295704 -0.7014029 0.3150514 0.1465555 0.3241581 -0.248396 0.0489845 0.0407529 -0.0323109 -0.0443987 0.0246847 0.0578544 0.0210248 0.0629345 0.0794176 -0.0825813 0.0055513 0.0831303 -0.0913869 -0.1193787 0.071332 0.1314171 0.0431122 -0.4684591 -0.2124187 -0.0845351 0.0783025 -0.07511 0.0516747 0.0138566 0.0507659 0.0204132 0.0562561 -0.0017143 0.1009506 -0.0794921 0.0855562 -0.0668385 0.1086431 -0.0252977 0.1171116 -0.0220211 0.0644678 -0.0402819 -0.0266141 -0.0194051 -0.1362068 -0.1628398 -0.02658 -0.1217925 -0.0242078 -0.0725413 -0.0501604 -0.0419564 -0.1413034 -0.4122557 -0.1671566 0.0106966 -0.130936 -0.1817591 -0.0018401 0.1237101 -0.0417684 0.0696337 -0.1357784 0.0666292 -0.0606702 0.0596504 0.0493713 -0.2092388 -0.1194931 0.0102533 -0.0921478 0.0328539 0.0072768 0.0176099 -0.0008411 0.0716268 0.0591341 -0.0005211 0.0621574 0.0095828 0.0733982 0.0257408 0.046586 -0.016109 -0.227251 -0.043268 -0.0471552 0.015281 -0.0404576 0.0959366 -0.0020927 -0.0721954 -0.0289218 -0.0479418 -0.0382782 -0.0325682 0.0263384 0.0559117 -0.0085164 -0.0729216 0.057153 -0.0521016 0.0712534 unknown
polarizability: 132.3794185|16.468039|112.6933175|-6.9385602|-13.0931537|93.2664991 unknown
InChI: InChI=1/C5H12BN3/c1-6(2)5-4-9(3)8-7-5/h4,6-7H,1-3H3
charge 0 multiplicity 1
21 atoms
C  1.59087153 -0.06646158 -0.06436563
C  -0.27894261 -1.60411407 0.66924519
H  0.38181761 -2.34798639 1.08123666
C  -1.64745463 -1.5165143 0.57920268
N  0.20265312 -0.471395 0.08794239
N  -0.76759298 0.30720779 -0.35243337
N  -1.86092845 -0.33319191 -0.0503086
B  -3.07796614 -2.20176862 0.89076121
H  -3.14905617 -0.49143997 -0.01065108
H  -3.84308873 -1.15134935 0.31433161
H  1.6059585 0.84997905 -0.64927342
C  -3.51464596 -2.22918539 2.43666347
H  -4.57153431 -2.49140685 2.55685682
H  -2.9365102 -2.99724947 2.96813096
H  -3.34264049 -1.28087058 2.95749655
C  -3.43311237 -3.49911056 0.01218667
H  -2.84812274 -4.35699282 0.37055396
H  -4.48874034 -3.77724987 0.10439673
H  -3.2089388 -3.38110743 -1.05363117
H  2.03246363 0.11256558 0.91581587
H  2.14306047 -0.84749106 -0.58597155
