program: Gaussian 16
title: me_naphthalene_ts1
version: ES64L-G16RevC.02
frameworkgroup: C1[X(C14H20BN)]
method: RwB97XD
basis: GenECP
operation: Freq
keyword: #N
keyword: Geom=AllCheck
keyword: Guess=TCheck
keyword: SCRF=Check
keyword: GenChk
keyword: RwB97XD/GenECP
keyword: Freq
converged: YES YES YES YES
title: Mulliken charges:
elementType: C C C C C C H C C H H C C H H H B C H H H C H H H N C H H H C H H H H H
charge: -0.306213 0.126791 -0.109010 0.411538 -0.271699 -0.562465 0.163205 0.264534 -0.157578 0.187063 0.233412 -0.604520 -0.135310 0.210384 0.225944 0.197194 -0.357294 -0.636375 0.172823 0.174372 0.165354 -0.528054 0.192914 0.151865 0.166177 0.071898 -0.480461 0.181907 0.186179 0.188601 -0.308774 0.189197 0.142723 0.198398 0.114303 0.140975
chargesum: -0.00000
title: Mulliken charges with hydrogens summed into heavy atoms:
elementType: C C C C C C C C C C B C C N C C
charge: -0.143008 0.126791 -0.109010 0.411538 -0.084636 -0.329053 0.264534 0.052806 -0.378576 0.061883 -0.102016 -0.123825 -0.017098 0.071898 0.076226 0.221544
chargesum: 0.00000
1716.lowfreq: -315.8298 -10.8255 -6.8546 -4.7054 0.0005 0.0006 0.0006 45.5559 90.4386
frequency: -315.8289 45.4958 90.4338 110.6937 136.8219 158.5092 162.2982 197.9621 199.3131 231.2156 253.7955 261.1679 275.9656 284.2082 309.9474 329.1533 363.9130 397.5370 419.8698 466.9055 488.4223 504.2034 518.5175 531.8519 550.9932 564.0512 621.5820 635.9189 688.0043 704.0442 736.8287 753.3275 778.6894 797.4164 801.6157 805.5008 829.7729 854.8629 864.0552 914.7230 926.3872 943.7617 963.9632 984.0003 1002.6302 1013.6420 1053.4691 1072.1573 1076.6638 1088.2232 1118.9421 1130.5960 1147.7045 1180.9239 1190.0315 1199.4791 1226.6995 1237.4466 1248.4804 1257.1594 1273.9493 1333.6105 1337.5180 1344.5847 1372.2940 1393.8633 1414.1441 1446.9406 1464.2717 1465.7052 1471.2754 1474.7637 1482.6418 1483.6537 1489.6276 1496.2720 1501.7572 1513.3836 1526.1544 1561.4013 1643.1285 1665.3433 1687.1794 2984.8653 2992.3247 3024.2415 3026.5430 3080.2214 3082.1432 3089.4618 3093.9119 3103.6874 3123.4768 3131.6646 3141.9688 3179.7250 3184.0897 3195.0198 3200.2358 3208.4060 3214.1291 3768.8167
redmass: 1.4252 3.4060 2.4309 3.0065 2.7805 3.8083 1.8995 1.3916 3.1156 2.2634 1.2290 1.1338 2.0059 1.1692 2.9459 2.8663 3.2773 2.5174 2.6931 2.7399 3.2348 2.1949 3.3397 2.6768 4.7593 1.9341 3.1453 3.0318 2.1530 1.4374 1.0938 3.6457 1.3365 1.3651 1.9998 2.6738 2.4892 1.5088 2.6172 2.6478 1.6164 1.4693 1.8087 2.5797 1.3271 1.3440 3.5666 2.5662 1.5728 2.6449 1.3390 1.8321 2.0790 1.4253 1.4552 1.2983 2.1974 1.6876 1.2337 2.6524 1.9232 1.5713 1.4519 1.7182 3.2524 4.2895 3.2260 1.1588 1.0554 1.8163 1.0555 1.2433 1.0506 1.0530 1.0628 1.0774 1.2817 1.6604 1.0833 4.3252 6.2764 5.4188 6.3061 1.0519 1.0473 1.0382 1.0390 1.0838 1.0893 1.0976 1.0974 1.1015 1.0987 1.1025 1.1014 1.0864 1.0868 1.0920 1.0925 1.0960 1.0962 1.0090
irintensity: 234.4551 0.9293 0.4765 2.6923 2.2687 2.9316 3.5099 0.5845 0.9616 3.7700 1.1804 0.7152 0.3141 0.8488 2.6886 0.2247 7.2878 3.0364 1.6345 0.3649 2.6331 4.7918 5.5107 22.9634 1.0210 28.9292 6.3983 6.2918 20.4626 86.3417 18.8263 4.4804 5.5237 3.5627 58.5824 32.5097 12.4408 6.3758 19.9352 8.5716 4.7552 9.8746 55.8655 9.2028 0.5230 0.8470 41.0246 46.8206 7.8142 44.9396 22.4371 4.2365 76.4027 35.0793 37.4643 10.2894 3.9622 13.0403 8.6625 20.6742 32.1656 38.2397 35.9769 36.5313 25.5915 10.9786 15.2782 1.4295 1.3957 4.7650 3.8356 0.2839 2.7781 4.3100 3.5752 25.4501 5.5056 28.4762 23.6951 25.4329 18.0845 3.2111 6.6258 85.9477 102.7453 19.2081 25.2308 54.4035 16.9868 11.4817 55.8714 41.8952 41.3393 18.2215 21.5059 1.3657 1.2442 17.5651 28.2687 35.0608 17.8608 495.7820
temp: 298.150 k
press: 1.00000 atm
elementType: 6 6 6 6 6 6 1 6 6 1 1 6 6 1 1 1 5 6 1 1 1 6 1 1 1 7 6 1 1 1 6 1 1 1 1 1
symmnumber: 1
zpe: 803713.1 jmol-1
zpe.correction: 0.306118 hartree
zpe.thermalcorrener: 0.321837 hartree
zpe.thermalcorrenthalpy: 0.322782 hartree
zpe.thermalcorrgfe: 0.264966 hartree
zpe.sumelectzpe: -624.751710 hartree
zpe.sumelectthermal: -624.735991 hartree
zpe.sumelectthermalent: -624.735047 hartree
zpe.sumelectthermalfe: -624.792863 hartree
dipole: -1.3351 -2.0058 1.0810
dipole: 2.6409
quadrupole: -97.0035 -86.8258 -103.1718
quadrupole: 0.1429 2.8981 -1.9457
quadrupole: -1.3365 8.8412 -7.5048 0.1429 2.8981 -1.9457
hfenergy: -625.0578287 hartree
pointgroup: C01 [X(C14H20B1N1)]
dipole: -0.5963417 -0.5131608 0.6786783 debye
polarizability: 267.9816474|2.9639266|249.9809742|-18.4518293|-11.129355|152.1759045 unknown
InChI: InChI=1/C14H18BN.2H/c1-15(2)12-9-5-7-11-8-6-10-13(14(11)12)16(3)4;;/h5-10H,1-4H3;;
charge 0 multiplicity 1
36 atoms
C  -5.43962833 -0.43079078 0.52012857
C  -4.09091895 -0.6971201 0.48817427
C  -3.14974287 0.3316252 0.15146851
C  -3.66137515 1.66014062 0.0621538
C  -5.05721042 1.90066707 0.12412681
C  -5.9341404 0.86928919 0.30324504
H  -6.13748674 -1.22336505 0.76354851
C  -1.74551252 0.09627908 -0.09765656
C  -2.76836392 2.75160223 -0.10069757
H  -5.41453452 2.92008433 0.02122727
H  -7.00279247 1.04953058 0.33249741
C  -1.4265022 2.53328348 -0.19226429
C  -0.93648266 1.20872259 -0.21797902
H  -3.17588173 3.75653305 -0.14504756
H  -0.73718287 3.36432207 -0.29508829
H  0.12430857 1.07312078 -0.39556296
B  -1.08282147 -1.27098618 -0.63302194
C  0.5205394 -1.37675018 -0.68301641
H  0.85479292 -2.40481962 -0.8573163
H  0.88303685 -0.79143732 -1.53658369
H  1.03113375 -1.0006867 0.20943902
C  -1.84858564 -1.97756921 -1.84759594
H  -1.60657941 -1.40561713 -2.75257073
H  -1.51326444 -3.00519092 -2.02341383
H  -2.93744652 -1.97656392 -1.75675901
N  -3.59664773 -1.97554079 0.90404092
C  -3.27625908 -1.97609445 2.33056898
H  -4.1780615 -1.88383623 2.95375467
H  -2.76759843 -2.91020649 2.58703855
H  -2.60706481 -1.14394211 2.55790211
C  -4.39901543 -3.13070201 0.53259106
H  -3.80114173 -4.03453844 0.67993737
H  -5.31641778 -3.23617358 1.13159311
H  -4.6723203 -3.06706586 -0.52134102
H  -1.77931792 -2.27510971 0.51138996
H  -1.00367054 -2.3790345 0.55601518
