program: Gaussian 16
title: Napht_Me-TS1
version: ES64L-G16RevC.01
method: RwB97XD
basis: GenECP
operation: Freq
keyword: #N
keyword: Geom=AllCheck
keyword: Guess=TCheck
keyword: SCRF=Check
keyword: GenChk
keyword: RwB97XD/GenECP
keyword: Freq
converged: YES YES NO YES
title: Mulliken charges:
elementType: C C C C C C H C H H C C H H H N B C H H H C H H H H H
charge: -0.473366 0.295641 -0.792552 0.349631 -0.235483 -0.338232 0.217987 0.478563 0.207204 0.235685 -0.646804 -0.072671 0.259713 0.245777 0.249713 0.210762 -0.038782 -0.601014 0.150101 0.136099 0.142265 -0.609035 0.128051 0.159464 0.141758 0.283443 -0.083918
chargesum: -0.00000
title: Mulliken charges with hydrogens summed into heavy atoms:
elementType: C C C C C C C C C N B C C
charge: -0.255379 0.295641 -0.792552 0.349631 -0.028279 -0.102547 0.738276 -0.401027 0.177042 0.494206 -0.122700 -0.172549 -0.179763
1716.lowfreq: -794.1488 -5.8935 -0.0004 -0.0003 -0.0001 4.3785 7.9285 17.4966 97.7901
frequency: -794.1488 16.6146 97.7867 172.7911 178.0017 199.8464 205.7111 214.4938 237.8654 302.9205 386.4663 438.3468 463.4944 475.3330 488.2954 549.8938 581.7929 583.7877 654.9853 672.8309 683.0503 780.3057 784.1171 813.0901 824.4570 832.9347 849.0690 872.6653 888.8700 944.4524 961.9249 983.0525 1002.7794 1013.2535 1021.2070 1056.5997 1078.3389 1092.6443 1107.5517 1136.3941 1164.2101 1195.8286 1199.2662 1245.6419 1274.4177 1284.4291 1326.6568 1330.6344 1355.2576 1411.5095 1444.1535 1463.6220 1466.7440 1473.1044 1477.5353 1484.7609 1506.7872 1553.5857 1652.1754 1661.1638 1684.7931 1760.7478 2242.4782 3009.8044 3011.7045 3075.6237 3077.9667 3088.1059 3091.3513 3173.7066 3189.9585 3192.3454 3196.3562 3206.9710 3227.8960
redmass: 1.1251 2.7765 3.3383 3.8965 3.8561 1.9572 1.0364 1.6600 1.7046 3.3177 3.2610 3.7678 4.1939 3.1616 3.3561 6.3281 3.6918 3.7217 2.6582 1.1719 5.5540 1.2649 2.5402 2.2686 1.4281 4.9790 1.9798 3.1857 1.3308 1.3777 1.8177 1.4031 3.0866 1.3378 1.3508 2.4713 2.9899 2.0046 2.2975 1.4220 1.3033 1.3404 1.0779 1.9930 1.6553 1.9718 1.3312 1.2711 2.9101 2.5362 4.8933 1.9953 1.0522 1.0511 1.0575 1.0629 2.7217 3.8466 5.6287 6.3078 6.6481 1.0661 1.0419 1.0368 1.0368 1.0982 1.0975 1.1013 1.1009 1.0884 1.0892 1.0898 1.0927 1.0978 1.0972
irintensity: 3099.8529 0.0052 0.8500 4.3101 0.4806 2.4901 0.0557 1.3171 3.6946 3.6194 39.4980 3.1803 1.6270 0.5712 16.7123 1.3078 1.6840 23.9931 0.7269 5.5488 46.1279 8.5665 8.1814 50.7946 4.4465 7.2338 61.3675 2.0665 0.0331 1.7461 35.8773 0.1449 106.9336 0.2097 1.8599 4.8890 46.2633 2.9133 14.6644 30.3373 15.0299 27.3511 6.7590 3.9323 5.3794 16.9009 48.2349 20.4610 20.6129 45.1291 36.3426 9.7440 0.1983 1.7202 1.8009 6.8150 15.9709 45.6239 63.3102 11.5120 50.1299 124.1618 2036.4002 42.0624 34.0803 16.7627 70.3523 48.9209 82.4413 13.2854 9.2374 5.0025 12.1874 26.7780 8.9444
temp: 298.150 k
press: 1.00000 atm
elementType: 6 6 6 6 6 6 1 6 1 1 6 6 1 1 1 7 5 6 1 1 1 6 1 1 1 1 1
symmnumber: 1
zpe: 579287.5 jmol-1
zpe.correction: 0.220639 hartree
zpe.thermalcorrener: 0.232224 hartree
zpe.thermalcorrenthalpy: 0.233168 hartree
zpe.thermalcorrgfe: 0.182584 hartree
zpe.sumelectzpe: -506.918577 hartree
zpe.sumelectthermal: -506.906991 hartree
zpe.sumelectthermalent: -506.906047 hartree
zpe.sumelectthermalfe: -506.956632 hartree
dipole: 0.6774 5.6446 -0.0266
dipole: 5.6851
quadrupole: -70.6454 -67.1539 -86.8424
quadrupole: -7.6972 -0.0680 -0.4130
quadrupole: 4.2352 7.7266 -11.9618 -7.6972 -0.0680 -0.4130
hfenergy: -507.1392156 hartree
pointgroup: C01 [X(C11H14B1N1)]
dipole: 0.2665015 2.2207428 -0.0104631 debye
polarizability: 206.917671|17.0887183|225.4120808|-3.0662319|-3.0084919|109.5547021 unknown
InChI: InChI=1/C11H13BN.H/c1-12(2)10-7-3-5-9-6-4-8-13-11(9)10;/h3-8,12H,1-2H3;
charge 0 multiplicity 1
27 atoms
C  -4.05775605 -0.02822474 0.0826642
C  -2.6812978 -0.0154869 0.05116961
C  -2.07458521 1.27109559 0.00698126
C  -2.81720199 2.47540697 -0.00853067
C  -4.2298803 2.39258241 0.02229109
C  -4.8269198 1.16043156 0.06801295
H  -4.58125467 -0.97936084 0.11781344
C  -2.08853945 3.68606432 -0.05469879
H  -4.81949714 3.30274434 0.00938745
H  -5.90898873 1.08911322 0.09276247
C  -0.71712558 3.66399516 -0.08147371
C  -0.05530717 2.42161965 -0.05892591
H  -2.62472119 4.62960784 -0.06807833
H  -0.13805259 4.57771465 -0.11692712
H  1.02796622 2.36157935 -0.07362923
N  -0.71590327 1.28957529 -0.01743661
B  -1.77346189 -1.34981142 0.0345368
C  -1.93443944 -2.26307122 1.3541509
H  -2.95666425 -2.66231567 1.39313242
H  -1.25777095 -3.12488961 1.3544798
H  -1.77607307 -1.70898411 2.28609188
C  -1.80434972 -2.12058827 -1.38274936
H  -1.1211305 -2.97698704 -1.41042121
H  -2.81504887 -2.51177689 -1.55807776
H  -1.56557326 -1.47143389 -2.23302509
H  -0.45981482 -0.11025592 0.05881608
H  -0.4338159 -1.0192376 0.13510845
