program: Gaussian 16
title: me_xanthene_ts1-scan
version: ES64L-G16RevC.02
method: RwB97XD
basis: GenECP
operation: Freq
keyword: #N
keyword: Geom=AllCheck
keyword: Guess=TCheck
keyword: SCRF=Check
keyword: GenChk
keyword: RwB97XD/GenECP
keyword: Freq
converged: YES YES NO YES
title: Mulliken charges:
elementType: C C C C C C H H H C O C H H H C H H H C C C C C H C H H B N C H H H C H H H C H H H C H H H H H
charge: 0.377359 -0.297633 -0.688727 -0.072935 0.225466 -0.007564 0.218587 0.236897 0.177524 -0.226059 -0.100672 -0.461931 0.166534 0.167000 0.200841 -0.792763 0.182285 0.188138 0.189574 0.171654 -0.059170 0.274904 0.015427 -0.669946 0.171547 -0.415607 0.246153 0.169759 0.117281 0.318212 -0.548572 0.128615 0.166622 0.194789 -0.762255 0.171585 0.159775 0.150393 -0.344233 0.168268 0.193559 0.156289 -0.383964 0.189095 0.149778 0.175852 -0.003385 0.015656
chargesum: -0.00000
title: Mulliken charges with hydrogens summed into heavy atoms:
elementType: C C C C C C C O C C C C C C C C B N C C C C
charge: 0.377359 -0.079046 -0.451830 0.104588 0.225466 -0.007564 -0.226059 -0.100672 0.072444 -0.232766 0.171654 -0.059170 0.446451 0.015427 -0.423793 -0.245849 0.113896 0.333868 -0.058546 -0.280502 0.173883 0.130761
1716.lowfreq: -1152.5181 -1128.5038 -3.7152 -0.0005 -0.0001 0.0005 3.7755 5.0211 39.2209
frequency: -1152.4244 -1128.4001 39.1899 51.2758 58.7024 65.2637 99.9522 117.4583 135.8206 147.6023 151.6527 159.9185 167.2028 183.9055 209.1029 232.0710 237.9522 249.2775 257.3829 270.5567 283.9773 290.6955 296.7525 309.1248 312.1693 320.9960 334.0169 352.0257 375.9272 389.4008 397.8551 402.3958 452.6555 463.8689 465.8624 523.2691 537.6660 555.1070 573.0117 584.0596 596.1068 609.2087 660.8801 677.6532 687.8878 716.5540 767.4199 781.8393 793.8998 816.7530 825.9071 842.1639 855.6937 860.7775 890.6184 899.0794 915.5673 924.2970 944.7789 957.2208 976.5658 994.4045 1008.3241 1025.2357 1032.0655 1082.1413 1086.2570 1111.3725 1117.2935 1127.2409 1143.8964 1160.8175 1171.7005 1181.7106 1190.5193 1199.5562 1221.9355 1232.4216 1247.4081 1266.9482 1279.4116 1289.7894 1296.6118 1312.8025 1325.4825 1337.2470 1342.5434 1344.0806 1375.2219 1402.4479 1425.1047 1445.1420 1449.4135 1451.0187 1458.4072 1469.6172 1475.7986 1480.2813 1484.2361 1487.4371 1489.1890 1498.3700 1505.1586 1506.7653 1513.7449 1517.4687 1521.9087 1530.8945 1537.9471 1646.4222 1658.5591 1663.6376 1682.9078 2963.9033 2973.4444 3012.0683 3019.1463 3038.9007 3053.4752 3083.6529 3084.9089 3091.8479 3093.7764 3118.3849 3123.6251 3128.6549 3130.1266 3130.5546 3134.7972 3134.8800 3158.7503 3185.3460 3194.1279 3202.1447 3218.0387 3219.5940 3224.5583 5042.6911
redmass: 1.0080 1.0080 3.5718 3.3257 3.2778 3.0441 1.1624 2.7735 1.4233 3.0426 2.1399 2.7626 3.2369 2.4880 1.1547 1.0957 1.3469 1.2869 1.3703 1.7267 2.1414 3.4473 2.1284 1.3757 1.4097 2.6963 2.4275 3.2468 1.6157 3.3228 2.5611 3.0454 3.9302 3.1790 3.2043 4.3294 4.5718 3.5824 3.8540 4.4356 4.0856 4.1703 4.4961 1.9082 3.3744 2.5971 1.5524 1.8704 2.8669 2.4675 3.8355 4.2805 1.5433 2.4596 2.4232 5.4328 1.4454 2.1834 1.7322 1.4418 1.9758 1.3145 1.3398 2.1780 1.3796 1.4571 2.6085 2.3104 1.7971 1.4253 2.2474 2.0164 2.3559 1.4655 2.2821 1.3297 1.5545 2.2157 3.2337 3.3335 3.3166 2.0847 2.9708 2.3929 1.6673 2.9689 1.8702 4.5089 3.0986 1.2350 1.2411 1.1154 1.0647 1.1384 2.4813 1.1072 1.1794 1.1273 1.0557 1.1606 1.0693 1.1263 1.1782 1.1395 1.9154 1.8062 1.2215 1.2176 2.0526 5.5786 7.2118 6.8162 8.1251 1.0563 1.0559 1.0457 1.0417 1.0346 1.0364 1.0867 1.0769 1.0912 1.0817 1.1035 1.1022 1.1013 1.1010 1.1027 1.1034 1.1037 1.1006 1.0869 1.0877 1.0925 1.0913 1.0946 1.0953 1.0078
irintensity: 0.2257 0.5702 0.0659 0.6325 0.4493 1.6648 0.7292 1.1163 0.6058 0.4968 0.2230 0.3276 0.7593 2.5613 1.0339 0.0263 2.2640 0.2345 0.1057 0.1406 0.1771 2.3391 1.3359 0.4960 0.1277 1.3997 3.1665 1.1405 1.8989 1.8279 1.6972 0.4357 8.2994 0.8404 6.1817 3.2821 2.8264 1.3761 3.3957 7.2316 2.2231 1.8771 1.7060 6.4733 3.9396 5.9992 48.5895 60.0273 11.7257 14.2513 13.1278 2.5227 0.5301 0.2806 1.2684 50.3441 1.4681 23.5587 4.7103 2.6520 8.8685 0.6148 0.6673 80.3198 6.7142 17.0091 20.4027 22.3349 71.9205 13.0602 18.2756 23.9082 12.5787 20.8863 23.9600 11.7272 22.1705 24.8632 53.7604 141.8245 358.5752 68.3815 13.6191 7.3923 41.5592 61.0158 94.0486 41.3826 67.6865 11.2706 10.9501 12.5889 1.1027 21.6838 341.4902 9.4858 1.3066 25.5710 1.8114 44.2146 13.1172 16.1224 2.0594 33.0379 5.5582 6.4271 6.5641 28.8112 102.9115 43.0009 59.5081 26.0529 4.4237 104.4174 146.8637 3.1948 14.5348 34.6487 25.3032 17.5693 39.6402 27.0761 38.8829 23.6967 26.7895 39.6160 43.8411 18.6500 25.4722 27.7599 13.2993 4.2470 8.3321 19.1049 9.2753 22.1724 16.1325 27.9726
temp: 298.150 k
press: 1.00000 atm
elementType: 6 6 6 6 6 6 1 1 1 6 8 6 1 1 1 6 1 1 1 6 6 6 6 6 1 6 1 1 5 7 6 1 1 1 6 1 1 1 6 1 1 1 6 1 1 1 1 1
symmnumber: 1
zpe: 1062425.7 jmol-1
zpe.correction: 0.404657 hartree
zpe.thermalcorrener: 0.427581 hartree
zpe.thermalcorrenthalpy: 0.428525 hartree
zpe.thermalcorrgfe: 0.354991 hartree
zpe.sumelectzpe: -894.036259 hartree
zpe.sumelectthermal: -894.013335 hartree
zpe.sumelectthermalent: -894.012390 hartree
zpe.sumelectthermalfe: -894.085924 hartree
dipole: -0.4231 1.1973 -0.4196
dipole: 1.3374
quadrupole: -118.6531 -123.8604 -134.7539
quadrupole: -0.7005 4.7305 -4.6664
quadrupole: 7.1027 1.8954 -8.9981 -0.7005 4.7305 -4.6664
hfenergy: -894.4409152 hartree
pointgroup: C01 [X(C19H26B1N1O1)]
dipole: -0.1664545 0.4710523 -0.1650965 debye
polarizability: 323.857405|15.2359827|302.8648257|23.4613116|-49.265032|234.4805474 unknown
InChI: InChI=1/C19H24BNO.2H/c1-19(2)13-9-7-11-15(20(3)4)17(13)22-18-14(19)10-8-12-16(18)21(5)6;;/h7-12H,1-6H3;;
charge 0 multiplicity 1
48 atoms
C  -2.00842308 1.32192119 0.80348264
C  -0.62203697 1.12958267 0.8842043
C  0.27924283 2.13239784 0.56164002
C  -0.19124596 3.36318281 0.12186489
C  -1.55636655 3.61322291 0.01984931
C  -2.43374036 2.58523982 0.36963612
H  -0.24347027 0.16477773 1.20536604
H  1.34614493 1.95655298 0.63817924
H  0.52076311 4.13520956 -0.14283859
C  -2.14969452 4.95654537 -0.39046294
O  -3.78766324 2.79589576 0.2614257
C  -1.15395271 5.81816451 -1.16877429
H  -1.60334716 6.77756315 -1.43299023
H  -0.27871137 6.04393307 -0.55624362
H  -0.8207433 5.32457183 -2.08524213
C  -2.56654242 5.71843163 0.89032579
H  -1.68760795 5.91967768 1.50934962
H  -3.03576918 6.67013327 0.62529467
H  -3.2774243 5.13868846 1.48339276
C  -3.40904304 4.6590219 -1.19724777
C  -4.20943493 3.61012989 -0.75977661
C  -3.83098636 5.39514877 -2.30376791
C  -5.46093152 3.32457283 -1.330522
C  -5.03509741 5.09880128 -2.92305178
H  -3.2206852 6.2031074 -2.68628238
C  -5.85168509 4.0871671 -2.43072004
H  -5.35426301 5.67179497 -3.78618935
H  -6.80150619 3.88937575 -2.91124753
B  -2.97129577 0.13883815 1.19353068
N  -6.24539296 2.28321513 -0.78704686
C  -4.40712779 0.37538407 1.77664738
H  -5.06231862 0.50601606 0.90295073
H  -4.78336249 -0.47932388 2.34668152
H  -4.51221591 1.29016157 2.36395292
C  -2.46594283 -1.34612777 1.02893698
H  -2.07590247 -1.67258667 2.00501178
H  -3.29150852 -2.02738554 0.80003285
H  -1.66896974 -1.49225699 0.29588372
C  -6.77133499 2.58237995 0.54152674
H  -7.54799722 3.36309902 0.50292716
H  -7.20926549 1.67749835 0.96928249
H  -5.96860763 2.91154321 1.1992617
C  -7.26409152 1.72799284 -1.65723998
H  -7.64882718 0.81297325 -1.20089363
H  -8.11805533 2.40624384 -1.82096641
H  -6.83010175 1.47007402 -2.62507469
H  -3.81883438 0.23289431 -1.71964559
H  -4.30710718 0.64905692 -1.43229544
