program: Gaussian 16
title: no2_benzopiperidine
version: AS64L-G16RevC.02
method: RwB97XD
basis: GenECP
operation: Freq
keyword: #N
keyword: Geom=AllCheck
keyword: Guess=TCheck
keyword: SCRF=Check
keyword: GenChk
keyword: RwB97XD/GenECP
keyword: Freq
converged: YES YES NO YES
title: Mulliken charges:
elementType: H C C C C H C H H B H H C N C C C H H C H H C H H H H H H N N O O O O
charge: 0.235941 -0.450225 -0.725695 -0.493398 0.250684 0.273493 -0.346254 0.252936 0.207483 0.184348 0.212488 0.024301 0.420610 0.129885 -0.097179 -0.305294 -0.391351 0.243237 0.200698 -0.348820 0.247055 0.219244 -0.523572 0.228622 0.181504 0.224821 0.191348 0.223975 0.148225 -0.443486 -0.367565 -0.006156 0.115320 0.058760 0.024017
chargesum: -0.00000
title: Mulliken charges with hydrogens summed into heavy atoms:
elementType: C C C C C B C N C C C C C N N O O O O
charge: -0.214284 -0.452202 -0.240461 0.250684 -0.138771 0.396836 0.420610 0.154186 0.346756 0.161005 0.018775 0.067349 -0.151372 -0.443486 -0.367565 -0.006156 0.115320 0.058760 0.024017
chargesum: 0.00000
1716.lowfreq: -887.2788 -17.7712 0.0002 0.0006 0.0008 10.2605 17.6601 18.4372 36.1288
frequency: -887.2551 16.5230 33.9155 45.7759 63.8971 69.9879 76.9886 100.2435 143.7895 159.6995 202.6377 227.4342 250.0905 258.2825 313.8997 328.2004 334.0791 346.3549 388.8434 461.5075 480.6834 501.0296 512.2964 559.5351 562.1595 586.1522 644.7299 690.8777 722.9187 744.8543 775.1285 782.2656 793.1485 823.7118 828.0102 856.4874 867.5096 885.3040 905.9962 924.7857 935.4667 968.6037 981.5534 991.3317 996.9919 1020.5678 1031.0561 1046.8345 1061.9900 1072.6961 1080.9305 1102.1065 1136.6340 1158.3279 1176.7043 1193.8367 1207.5746 1232.8913 1263.6578 1270.4153 1294.8051 1304.4822 1317.5748 1321.3560 1342.5199 1361.5210 1365.4266 1396.0259 1399.0327 1402.8141 1430.0363 1484.4257 1486.1115 1488.8781 1490.5196 1496.8110 1499.7104 1502.4024 1513.6381 1527.0793 1602.1795 1620.0178 1641.1252 1675.9204 2672.7479 3014.0748 3020.6381 3036.1492 3048.7504 3052.2475 3103.1591 3107.1892 3110.4316 3113.4872 3138.5439 3193.7741 3202.9084 3211.6673 3220.8670
redmass: 1.1542 14.0277 10.8154 11.5600 3.4815 4.3206 4.3524 4.8683 8.2874 5.5521 4.3119 3.5663 2.1042 4.2378 8.2904 4.1067 4.5098 5.6569 2.0365 3.0206 3.8567 2.9915 2.0231 6.7575 3.3344 7.5459 4.2340 5.3367 2.7685 4.0736 3.2514 2.0543 1.8362 1.4806 2.6625 3.2913 5.3071 1.3993 1.4204 2.0307 2.0008 3.2497 1.4216 1.7318 1.4772 4.2917 1.3571 2.5456 1.5081 1.7931 1.9376 1.4844 1.9296 1.6764 2.1160 1.1419 1.3043 2.3796 2.3510 1.9559 1.3719 1.6528 1.3773 1.8268 1.3480 1.3546 1.4783 1.4970 1.4368 1.4062 1.5069 6.1688 1.1774 2.3061 1.1019 1.1363 1.3358 3.7148 1.1233 2.6830 13.7745 13.2845 6.1522 6.1881 1.0216 1.0706 1.0684 1.0688 1.0643 1.0636 1.0953 1.0990 1.1009 1.0993 1.0949 1.0868 1.0904 1.0947 1.0990
irintensity: 2628.3448 0.1604 0.3583 0.9317 0.1814 1.8504 0.4815 1.0289 10.7345 9.3220 1.1224 8.0216 2.0317 1.4482 0.6236 6.0069 2.8072 1.8152 0.0811 0.8566 7.2174 6.6970 0.7157 23.2895 14.5101 28.0550 3.2036 2.8138 68.4511 28.4838 5.0867 9.9337 32.2342 0.2331 29.9309 6.0160 26.0904 7.3369 0.1155 22.6965 2.3481 3.1680 4.0387 25.1560 13.8284 19.3765 0.5849 14.0588 25.5957 5.1695 3.7948 0.8340 9.7981 7.6001 7.3379 0.8376 0.3269 42.1047 9.6328 13.4142 4.6655 9.3902 10.3457 31.1658 32.8548 9.2729 22.9245 1.0031 2.5130 2.4261 8.0547 56.3137 17.8961 31.7020 16.6092 2.6213 15.5437 38.9067 13.6760 49.1447 309.4919 617.3861 28.2953 28.6895 1924.0388 17.2788 24.7089 28.0356 23.3893 34.4216 49.6692 37.6776 28.2375 29.3113 4.3479 1.7221 7.0059 4.4858 13.5528
temp: 298.150 k
press: 1.00000 atm
elementType: 1 6 6 6 6 1 6 1 1 5 1 1 6 7 6 6 6 1 1 6 1 1 6 1 1 1 1 1 1 7 7 8 8 8 8
symmnumber: 1
zpe: 726198.8 jmol-1
zpe.correction: 0.276595 hartree
zpe.thermalcorrener: 0.293624 hartree
zpe.thermalcorrenthalpy: 0.294568 hartree
zpe.thermalcorrgfe: 0.229318 hartree
zpe.sumelectzpe: -918.316611 hartree
zpe.sumelectthermal: -918.299582 hartree
zpe.sumelectthermalent: -918.298638 hartree
zpe.sumelectthermalfe: -918.363888 hartree
dipole: 5.3299 -9.1014 -0.5910
dipole: 10.5638
quadrupole: -106.7009 -132.2606 -124.9601
quadrupole: 14.9698 6.0183 -1.0811
quadrupole: 14.6063 -10.9534 -3.6529 14.9698 6.0183 -1.0811
hfenergy: -918.5932059 hartree
pointgroup: C01 [X(C11H16B1N3O4)]
dipole: 2.0969366 -3.5807807 -0.2325321 debye
polarizability: 240.3010809|-9.6584926|217.5454031|1.6171711|13.4723481|156.9035376 unknown
InChI: InChI=1/C11H14BN3O4.2H/c16-14(17)12(15(18)19)10-6-2-3-7-11(10)13-8-4-1-5-9-13;;/h2-3,6-7H,1,4-5,8-9H2;;
charge 0 multiplicity 1
35 atoms
H  -4.31090117 -1.48984069 -0.49098966
C  -3.25882865 -1.25414496 -0.38226808
C  -2.86818079 0.05306639 -0.1287723
C  -2.30368748 -2.25818313 -0.49455604
C  -1.5163363 0.38312783 0.01404294
H  -3.61767841 0.82931021 -0.03177102
C  -0.95685608 -1.95321601 -0.35712016
H  -2.60685571 -3.27959388 -0.69350225
H  -0.20931947 -2.73302913 -0.45096315
B  -1.0565192 1.85848308 0.29519997
H  0.40298773 1.96525761 0.74483604
H  0.55681526 1.16424289 0.44042122
C  -0.56766724 -0.64186727 -0.11141161
N  0.82149172 -0.28525964 0.02553923
C  1.52363019 -0.98787741 1.1169876
C  1.56344697 -0.32378099 -1.25304348
C  2.90120453 -0.37482153 1.33530159
H  0.90713501 -0.90504051 2.01456954
H  1.61903399 -2.05439531 0.87145137
C  2.94200524 0.29756852 -1.08166393
H  0.97467672 0.2245856 -1.98852751
H  1.64944889 -1.36808496 -1.58537507
C  3.71819445 -0.38423033 0.04398411
H  3.41210178 -0.93010734 2.12563986
H  2.78355457 0.65476578 1.69207427
H  3.48104502 0.22333657 -2.02918278
H  2.82534002 1.36510178 -0.86344458
H  4.67907468 0.11186063 0.19957502
H  3.93590905 -1.4211953 -0.24024997
N  -0.97117745 2.79806724 -0.96326263
N  -1.69563454 2.59939777 1.52094726
O  -0.13336089 2.50480005 -1.80447815
O  -1.7429218 3.73141556 -1.06974528
O  -2.91219477 2.66233238 1.54548553
O  -0.97198061 3.06495515 2.38723535
