program: Gaussian 16
title: MeQHBN2O4 TS1
version: ES64L-G16RevC.01
method: RwB97XD
basis: GenECP
operation: Freq
keyword: #N
keyword: Geom=AllCheck
keyword: Guess=TCheck
keyword: SCRF=Check
keyword: GenChk
keyword: RwB97XD/GenECP
keyword: Freq
converged: YES YES YES YES
title: Mulliken charges:
elementType: C C H C N N N B H H H H H N O O N O O
charge: -0.387903 -0.319683 0.284305 -0.489122 0.275961 -0.257622 0.059447 0.404703 0.372433 0.040936 0.222355 0.222093 0.210630 -0.362392 -0.012384 0.057051 -0.367559 -0.010408 0.057159
chargesum: -0.00000
title: Mulliken charges with hydrogens summed into heavy atoms:
elementType: C C C N N N B N O O N O O
charge: 0.267175 -0.035378 -0.489122 0.275961 -0.257622 0.431879 0.445640 -0.362392 -0.012384 0.057051 -0.367559 -0.010408 0.057159
1716.lowfreq: -755.5377 -11.0130 -0.0010 -0.0007 -0.0005 7.3318 10.7246 20.0656 46.2440
frequency: -755.5376 14.6589 46.1909 61.3032 63.5043 81.8101 123.1251 151.9937 193.1368 286.5200 294.9759 329.7463 346.1689 437.3074 570.5419 637.4176 660.9217 663.2209 709.7481 724.5984 766.4690 810.2217 855.8236 864.6915 975.0352 989.2614 1019.2962 1073.6283 1078.9192 1102.7437 1157.2798 1161.9901 1190.0800 1314.8275 1344.3000 1385.8203 1456.1703 1482.1154 1488.9514 1493.0352 1510.3966 1518.7017 1605.6558 1622.5364 1631.3671 1689.8031 2569.3339 3086.0106 3174.3789 3200.1184 3305.5583
redmass: 1.1610 14.5998 14.6197 5.7654 1.0609 6.9962 8.1606 10.4497 4.0040 4.8963 9.7525 10.4434 8.6777 3.7532 10.2799 9.1965 1.3384 3.8380 5.6279 9.6338 5.3685 3.9837 10.5197 1.4939 9.9842 1.1429 4.9190 2.3670 1.9156 3.0918 1.3687 1.5149 1.9444 5.3120 5.4937 5.1139 1.3647 14.6581 1.0470 1.7337 10.8370 1.7132 14.3356 5.4395 6.4937 1.2018 1.0246 1.0326 1.1072 1.1059 1.1033
irintensity: 1602.5910 0.0057 0.0214 0.6542 0.0731 11.8689 12.1283 5.2035 1.3887 12.0528 0.0839 5.5300 0.0441 10.0850 45.9702 17.4029 39.0611 1.0062 17.2021 3.5769 44.9334 54.7169 72.5420 13.3796 57.2585 8.1434 10.3642 4.7726 0.7250 9.8916 35.9154 81.5788 131.1253 7.9934 11.9420 12.1644 3.1485 70.7667 18.5508 18.1892 18.8038 9.8006 15.6799 684.6438 51.3328 322.7789 1278.9576 15.4789 3.2989 0.1496 10.3280
temp: 298.150 k
press: 1.00000 atm
elementType: 6 6 1 6 7 7 7 5 1 1 1 1 1 7 8 8 7 8 8
symmnumber: 1
zpe: 324914.2 jmol-1
zpe.correction: 0.123753 hartree
zpe.thermalcorrener: 0.135915 hartree
zpe.thermalcorrenthalpy: 0.136859 hartree
zpe.thermalcorrgfe: 0.081917 hartree
zpe.sumelectzpe: -717.041775 hartree
zpe.sumelectthermal: -717.029613 hartree
zpe.sumelectthermalent: -717.028669 hartree
zpe.sumelectthermalfe: -717.083611 hartree
dipole: 8.3900 4.2768 -1.9523
dipole: 9.6174
quadrupole: -94.2730 -100.7237 -89.1823
quadrupole: -23.2134 10.5433 5.7607
quadrupole: 0.4534 -5.9974 5.5440 -23.2134 10.5433 5.7607
hfenergy: -717.1655281 hartree
pointgroup: C01 [X(C3H6B1N5O4)]
dipole: 3.3008823 1.682641 -0.7681054 debye
dipolederiv: 0.612466 0.1208986 -0.0378093 0.1429249 0.1879529 0.023589 -0.0747942 0.0189487 0.1938699 0.247428 -0.100945 0.0626437 0.1885482 0.0179767 -0.0068407 -0.0981145 -0.0153009 -0.0029517 0.1106028 0.010219 -0.007348 0.0082678 0.1464146 0.0256641 -0.004591 0.0249755 0.1812009 -0.3760304 0.0536719 -0.0369977 -0.1759963 -0.3746721 0.0965584 0.0866602 0.1010905 -0.237896 -0.6531111 -0.1917993 0.077476 -0.0709011 0.1015902 -0.084794 0.0433565 -0.0783615 -0.0111382 0.1510437 -0.2211561 0.1248638 -0.1502912 -0.316277 0.1169701 0.0821818 0.1071129 -0.1390279 -0.9601017 -0.2129646 0.0849462 -0.2466062 -0.1419396 -0.0446229 0.1074873 -0.0359677 -0.1779343 0.8564539 -0.0000955 0.0051817 0.335251 1.2318821 -0.1870313 -0.1712993 -0.1954025 0.9549234 0.9896357 0.723947 -0.3489044 0.6234958 0.6458048 -0.2635439 -0.2988568 -0.2628728 0.2283946 -0.0521679 -0.0433718 0.0201188 -0.2953181 -0.4715746 0.2586882 0.1510137 0.267001 -0.0896823 0.0536647 0.0405457 -0.0335817 -0.0396362 0.0377687 0.054358 0.0185354 0.0586532 0.0835707 -0.031442 -0.0413267 0.0220476 -0.0364316 0.1032846 -0.0030902 -0.0556785 -0.0255599 -0.0360555 -0.0222535 -0.035594 0.01809 0.0446793 -0.004333 -0.0667851 0.0453643 -0.0488799 0.0825013 1.3905379 -0.8243838 0.0122302 -0.934487 0.5139142 -0.155144 0.0230315 -0.2054337 0.770248 -0.8026317 0.3109611 -0.0189875 0.4084389 -0.5401715 0.1515204 -0.3033641 0.4267404 -0.7754477 -1.0533579 0.4616596 0.0329768 0.3970472 -0.4864921 0.0571768 0.4383845 -0.0952145 -0.5736428 1.4149908 -0.4755977 0.6658422 -0.5505626 0.8076795 0.0607942 0.7524996 0.1121728 0.450152 -0.8264712 0.2022007 -0.24959 0.4928177 -0.9374723 0.1076449 -0.1531141 -0.1635515 -0.3498975 -1.0492562 0.2231308 -0.3931982 -0.1412405 -0.5213361 -0.141112 -0.5887024 0.00985 -0.5511868 unknown
polarizability: 144.3601974|3.9950973|109.9418866|-0.5062273|-12.6049651|91.2579433 unknown
InChI: InChI=1/C3H5BN5O4.H/c1-7-2-3(5-6-7)4(8(10)11)9(12)13;/h2,4H,1H3;
charge 0 multiplicity 1
19 atoms
C  1.61262285 -0.13079249 -0.03305248
C  -0.30081595 -1.61895746 0.67033575
H  0.31583091 -2.39497162 1.09020613
C  -1.65721963 -1.46990109 0.55515967
N  0.21155721 -0.50302176 0.10361202
N  -0.74115368 0.30803723 -0.34437382
N  -1.86090448 -0.27890151 -0.07022941
B  -3.04363217 -2.11573565 0.84899278
H  -3.34082253 -0.63498787 0.07183592
H  -3.9689206 -1.19398254 0.34611009
H  1.65366247 0.77535165 -0.63219036
H  2.04047664 0.0545433 0.95152151
H  2.15293415 -0.9325028 -0.5342249
N  -3.50568659 -2.23562816 2.33880743
O  -2.76915706 -2.8718014 3.07196116
O  -4.5452091 -1.70664628 2.69029166
N  -3.44136983 -3.41039291 0.06549262
O  -2.66944474 -4.34819851 0.15978569
O  -4.47406687 -3.42522576 -0.58097397
