program: Gaussian 16
title: no2_quinoline
version: AS64L-G16RevC.02
method: RwB97XD
basis: GenECP
operation: Freq
keyword: #N
keyword: Geom=AllCheck
keyword: Guess=TCheck
keyword: SCRF=Check
keyword: GenChk
keyword: RwB97XD/GenECP
keyword: Freq
converged: YES YES YES YES
title: Mulliken charges:
elementType: C C C C C C H C H H C C H H H N B H H N N O O O O
charge: -0.330277 -0.126580 -1.012994 0.416978 -0.357309 -0.376735 0.282616 0.814837 0.215697 0.250301 -0.835862 0.091487 0.270759 0.256112 0.274877 0.153191 0.266230 0.365068 0.023374 -0.290174 -0.444802 0.011396 0.010941 0.068661 0.002205
chargesum: -0.00000
title: Mulliken charges with hydrogens summed into heavy atoms:
elementType: C C C C C C C C C N B N N O O O O
charge: -0.047660 -0.126580 -1.012994 0.416978 -0.141611 -0.126434 1.085596 -0.579749 0.366365 0.518259 0.289604 -0.290174 -0.444802 0.011396 0.010941 0.068661 0.002205
1716.lowfreq: -926.5874 -23.5111 -0.0006 -0.0006 -0.0005 11.1511 18.6679 20.9951 38.8128
frequency: -926.5640 18.6102 28.3105 50.8556 70.4568 136.8422 151.3781 155.2035 179.4291 263.4987 269.3380 305.9667 337.5563 424.2941 431.6136 473.6032 519.1734 540.6920 548.9850 580.8832 593.6112 642.4490 680.9948 729.9623 765.8861 787.6401 792.2752 811.6779 833.7078 850.5730 856.7068 885.6549 960.5092 969.5544 987.3953 1018.0237 1022.9745 1030.6065 1051.8386 1058.2040 1082.7833 1107.6322 1120.1084 1166.9792 1208.4421 1248.9614 1282.8434 1298.0520 1364.9749 1406.3836 1443.1779 1455.3278 1468.1818 1487.1436 1503.4342 1519.8581 1562.0331 1604.6398 1619.5006 1664.3741 1667.9426 1693.1056 2525.2536 3197.6539 3202.1353 3209.0687 3212.1185 3223.5234 3234.9661
redmass: 1.1026 14.1338 8.4533 13.0124 7.7912 9.1762 7.2281 6.1451 4.3702 6.1843 6.1243 11.5499 13.5070 4.1253 4.5314 3.1828 7.7224 7.4303 4.2492 6.5243 9.8190 3.3594 7.2396 2.8373 5.4723 1.4147 4.3315 2.6625 5.2929 1.7166 2.2205 8.2027 6.1747 1.3904 1.4015 1.8210 1.8811 1.4216 1.3394 1.8629 2.0258 2.0202 1.9434 1.2917 1.3833 1.9811 1.6612 2.0202 3.0523 1.8468 4.3151 1.3964 2.0834 14.3787 14.1677 2.5655 3.7935 14.0053 12.7282 5.3953 7.4258 6.8837 1.0274 1.0886 1.0906 1.0930 1.0930 1.0968 1.0976
irintensity: 3066.4324 0.3034 0.1821 0.2811 1.6863 11.4928 5.9013 2.9722 5.3944 9.6250 14.7655 3.5868 0.3455 5.0226 5.7970 1.3776 18.6554 1.4654 6.9180 28.6054 30.2286 6.0145 26.3633 45.7452 12.8432 7.9063 4.2681 64.5724 3.3761 74.1682 8.1091 36.6583 23.1805 1.3831 1.9499 9.7664 19.8893 0.6524 7.9517 4.5209 7.7772 0.5993 1.5690 15.6943 21.1318 7.6907 0.7723 51.0966 8.3310 10.9104 30.9940 15.3261 6.9336 68.9187 33.2102 2.7679 51.9482 371.7731 579.6545 2.1640 79.9280 66.1898 2034.3090 0.8860 2.8900 4.7138 5.4160 6.2719 3.1667
temp: 298.150 k
press: 1.00000 atm
elementType: 6 6 6 6 6 6 1 6 1 1 6 6 1 1 1 7 5 1 1 7 7 8 8 8 8
symmnumber: 1
zpe: 452173.7 jmol-1
zpe.correction: 0.172224 hartree
zpe.thermalcorrener: 0.185894 hartree
zpe.thermalcorrenthalpy: 0.186838 hartree
zpe.thermalcorrgfe: 0.129021 hartree
zpe.sumelectzpe: -837.377294 hartree
zpe.sumelectthermal: -837.363624 hartree
zpe.sumelectthermalent: -837.362679 hartree
zpe.sumelectthermalfe: -837.420496 hartree
dipole: 12.0982 0.6649 0.0604
dipole: 12.1166
quadrupole: -116.1740 -82.5048 -115.0988
quadrupole: -6.8272 0.6594 1.8844
quadrupole: -11.5815 22.0877 -10.5063 -6.8272 0.6594 1.8844
hfenergy: -837.5495177 hartree
pointgroup: C01 [X(C9H8B1N3O4)]
dipole: 4.7597821 0.2616005 0.0237475 debye
dipolederiv: 0.2177716 -0.0549955 -0.0412001 0.129228 -0.0408599 -0.0151268 -0.0184503 0.0256783 -0.0815464 -0.2926005 0.0241138 0.0247579 -0.0693678 -0.3702636 0.0042446 0.0293529 0.0227416 -0.2373802 0.1996707 -0.3179154 -0.0460612 -0.0067224 0.0126566 -0.0336122 -0.0056783 -0.0088999 0.1103359 -0.4410075 0.2235405 0.0590912 -0.1808739 -0.0016899 0.0059842 0.027592 -0.0201524 0.042507 0.0817819 0.0478777 -0.0211604 -0.0198438 0.1212602 0.0301819 -0.0269531 0.0218568 -0.1325973 -0.2628431 0.0900304 0.0296895 0.0187746 0.1685556 0.0282256 0.0088869 0.0249184 -0.111492 0.0161174 0.0498595 0.0007057 0.0353869 0.1093792 -0.0108777 0.0063501 -0.0206975 0.1318924 0.3314252 -0.1698761 -0.0500647 -0.0227682 0.4648859 0.0557572 -0.0341807 0.0689288 -0.0510684 -0.015375 -0.0916117 0.0037155 -0.0499348 0.0333801 -0.0090888 0.0047449 -0.0064433 0.1508784 0.0831203 0.0163911 0.006525 0.0086348 -0.073485 -0.0257012 0.0067397 -0.0253041 0.1520897 -0.0454533 -0.2889783 -0.0425586 -0.0287925 -0.6221307 -0.0442548 -0.0191328 -0.014196 -0.1516183 0.414386 0.4696398 0.0238522 -0.1726306 0.4217947 0.0429201 -0.0320535 0.0067915 0.0642399 0.0029814 -0.045849 0.0055694 -0.0863041 0.0521591 -0.0019103 0.0084432 -0.0048097 0.1400791 -0.0224207 0.0590993 0.0201618 0.0459249 0.0664172 -0.0142057 0.0192109 -0.0181542 0.1620282 0.0859872 -0.0123548 0.003238 0.0348488 -0.0287427 -0.0164855 0.0115378 -0.0177381 0.131921 -1.4195892 -0.1780765 0.0845379 -0.0459973 -0.2558257 0.0081502 0.1111686 0.0089258 -0.187566 1.0743527 0.1230686 -0.0529065 -0.2291419 0.9279156 0.045235 -0.0317939 -0.0086042 0.9069747 2.099984 0.0925332 -0.125047 0.2086206 0.0470138 0.0006164 -0.2138951 -0.0068531 0.0904521 -0.7620118 0.0846273 0.0390644 0.3530354 -0.1391395 -0.0251284 0.0578292 -0.0196976 -0.0039478 0.2281066 -0.1122136 -0.2461984 0.1524061 1.8680828 -0.2333539 -0.4955295 -0.2070024 0.4426841 1.6207657 -0.4591988 -0.3927818 -0.5924198 0.2270581 0.2746776 -0.2353881 0.3036298 0.962183 -0.4629451 -0.2768355 0.2026808 -0.0654081 -1.1624149 0.1367057 0.3200702 0.496962 -0.5494679 -0.517836 0.3345099 0.1621121 -0.0090704 -1.1475306 0.0905633 0.3626303 -0.2880931 -0.4592209 -1.358384 0.2579 0.2513238 0.3296119 -0.3171645 -0.1230327 -0.2879561 -0.005894 -0.5076101 -0.8559847 0.1347142 0.1009532 0.2628035 -0.361312 -0.1704838 0.4264548 -0.3078932 -1.0147501 unknown
polarizability: 229.9721913|-18.2287983|207.2111623|-15.8765534|12.4014241|110.71036 unknown
InChI: InChI=1/C9H7BN3O4.H/c14-12(15)10(13(16)17)8-5-1-3-7-4-2-6-11-9(7)8;/h1-6,10H;
charge 0 multiplicity 1
25 atoms
C  -1.05839358 1.72959535 0.30821031
C  -0.92396475 0.37042478 0.15246232
C  0.39218291 -0.14828295 -0.00321208
C  1.52630377 0.69180944 -0.002356
C  1.33305429 2.0854603 0.15855721
C  0.06855156 2.58507091 0.3123967
H  -2.04508359 2.15921707 0.43487017
C  2.78824471 0.07631517 -0.16774658
H  2.19542161 2.74288029 0.15515945
H  -0.08127757 3.65091834 0.43589646
C  2.87567209 -1.28392042 -0.31818215
C  1.69570235 -2.04970662 -0.29601685
H  3.68186898 0.69118526 -0.1738843
H  3.82930194 -1.77788479 -0.44847157
H  1.7199547 -3.12853231 -0.40024535
N  0.51884213 -1.49044866 -0.14591095
B  -2.13305998 -0.63815254 0.09114466
H  -0.88213903 -1.90201501 -0.02681844
H  -1.74642091 -2.05249592 0.10378098
N  -3.11379328 -0.65277235 1.3166971
N  -2.92425069 -0.61718787 -1.26881254
O  -3.40619294 -1.71563246 1.84055169
O  -3.54210588 0.42733704 1.68522067
O  -4.07254789 -0.21568509 -1.29254377
O  -2.30508182 -0.98005563 -2.2573297
