program: Gaussian 16
title: QHBOH-TS1
version: ES64L-G16RevC.01
method: RwB97XD
basis: GenECP
operation: Freq
keyword: #N
keyword: Geom=AllCheck
keyword: Guess=TCheck
keyword: SCRF=Check
keyword: GenChk
keyword: RwB97XD/GenECP
keyword: Freq
converged: YES YES YES YES
title: Mulliken charges:
elementType: C C H C N N N B H H H H H O H O H
charge: -0.387862 -0.125123 0.253860 -0.661852 0.266531 -0.413741 0.199770 0.351704 0.297609 -0.161619 0.214977 0.215195 0.204833 -0.394315 0.266658 -0.393188 0.266564
chargesum: -0.00000
title: Mulliken charges with hydrogens summed into heavy atoms:
elementType: C C C N N N B O O
charge: 0.247143 0.128738 -0.661852 0.266531 -0.413741 0.497378 0.190085 -0.127657 -0.126624
1716.lowfreq: -1479.3503 -9.0696 -4.5804 -0.0010 -0.0008 -0.0005 11.9506 54.1900 86.1902
frequency: -1479.3503 53.3911 86.1555 106.4322 166.4261 212.0103 231.9921 295.6159 358.7684 401.4991 431.1125 572.8557 670.5793 685.4733 720.9057 773.8336 805.4486 846.0735 885.8491 965.8069 1067.0126 1075.8555 1078.4755 1112.9936 1155.2180 1160.1199 1191.8340 1222.1413 1273.7295 1341.2825 1349.5971 1403.7624 1453.9614 1478.6837 1487.9988 1515.8410 1570.6880 1631.2644 1948.7990 3083.4550 3169.9975 3197.2541 3299.8623 3948.7645 3949.6401
redmass: 1.1309 1.0565 4.1733 4.6709 1.1814 3.4837 3.7444 1.8488 2.0951 7.0569 3.2148 4.1415 3.5894 4.6435 3.6463 3.6176 1.3887 1.4805 2.2036 1.1041 4.0940 1.5905 2.4516 2.0591 1.3780 1.6646 8.8557 1.9541 1.0388 5.4698 3.8479 4.9929 1.4979 2.1802 1.0402 1.3233 1.8370 2.1225 1.0755 1.0328 1.1070 1.1056 1.1018 1.0660 1.0658
irintensity: 4785.5444 0.0164 9.1450 2.2125 26.6977 22.1107 0.1697 101.0180 98.0101 7.5664 43.5862 33.3989 3.1267 124.2831 0.1079 270.7647 0.1158 39.0080 325.1777 135.1616 85.3627 1.0552 61.8391 19.5411 2.5597 11.9790 468.0031 87.0093 80.4542 32.3269 219.0777 0.2968 7.1790 14.9264 17.5964 5.4417 154.5801 243.3192 192.1016 18.9830 4.7410 0.5448 2.8679 42.1928 60.2653
temp: 298.150 k
press: 1.00000 atm
elementType: 6 6 1 6 7 7 7 5 1 1 1 1 1 8 1 8 1
symmnumber: 1
zpe: 331595.6 jmol-1
zpe.correction: 0.126298 hartree
zpe.thermalcorrener: 0.135575 hartree
zpe.thermalcorrenthalpy: 0.136519 hartree
zpe.thermalcorrgfe: 0.091410 hartree
zpe.sumelectzpe: -458.538913 hartree
zpe.sumelectthermal: -458.529636 hartree
zpe.sumelectthermalent: -458.528692 hartree
zpe.sumelectthermalfe: -458.573802 hartree
dipole: 4.8395 0.2115 0.0691
dipole: 4.8446
quadrupole: -46.8229 -55.8809 -59.0842
quadrupole: 0.0880 -0.4208 -2.3397
quadrupole: 7.1064 -1.9516 -5.1549 0.0880 -0.4208 -2.3397
hfenergy: -458.6652115 hartree
pointgroup: C01 [X(C3H8B1N3O2)]
dipole: 1.9040137 0.0832141 0.0271694 debye
dipolederiv: 0.5803668 0.0946538 -0.0262372 0.1302286 0.1908691 0.0230119 -0.0661464 0.0190361 0.1989678 0.1454589 -0.2276058 0.1285464 0.1216407 -0.0284381 -0.0137252 -0.0627996 -0.025374 -0.0506215 0.071196 0.0250393 -0.0168013 0.0219091 0.1264727 0.0394502 -0.0139427 0.0390606 0.1787259 -0.3489461 0.138481 -0.0848502 -0.0588129 -0.3728955 0.1473022 0.0224736 0.151701 -0.1739882 -0.7122907 -0.2031189 0.0811077 -0.0427644 0.2535449 -0.1720993 0.0218628 -0.1703733 0.0209555 0.1911217 -0.1229463 0.0751774 -0.0565709 -0.3940977 0.1671715 0.0351104 0.1594488 -0.1550193 -1.3105405 -0.4152414 0.174794 -0.3957191 -0.0628012 -0.0527659 0.169304 -0.0481165 -0.0945858 1.197782 0.1029308 -0.0731955 0.4825714 2.0702151 -0.1473873 -0.2727033 -0.1623503 1.8283848 1.6258078 0.8861947 -0.4136039 0.6776402 0.4831925 -0.1610278 -0.3057264 -0.1532837 0.202595 -0.5464703 0.0033794 -0.0148489 -0.3066966 -0.7699233 0.3056594 0.1489036 0.3164239 -0.3279852 0.0509525 0.0428263 -0.03288 -0.0421804 0.0289507 0.0567029 0.0203893 0.0616738 0.0817911 -0.0369817 -0.0409974 0.0153159 -0.0373368 0.1001489 -0.0019102 -0.0659606 -0.0247597 -0.0437109 -0.0317933 -0.0304562 0.0214556 0.0503514 -0.0061402 -0.07016 0.0522473 -0.0525075 0.0757728 -0.649849 0.0355882 0.2640147 -0.088728 -0.7998916 0.1173271 0.4432567 0.286055 -1.543395 0.1992756 -0.0903317 -0.0111513 -0.0809441 0.3268264 -0.0112393 -0.0656085 -0.0378481 0.3510972 -0.6176481 -0.1505025 -0.1614615 -0.3782735 -1.509971 -0.2188641 -0.1565838 -0.3762046 -0.86784 0.1925584 -0.0478931 0.0746181 0.0036852 0.3639382 -0.0074461 0.0959236 0.0174185 0.3188559 unknown
polarizability: 114.3781735|12.6503615|91.9496043|-4.8038975|-14.0193071|71.4929172 unknown
InChI: InChI=1/C3H7BN3O2.H/c1-7-2-3(4(8)9)5-6-7;/h2,5,8-9H,1H3;
charge 0 multiplicity 1
17 atoms
C  1.56605516 -0.12106418 -0.03612214
C  -0.34185293 -1.62032143 0.67607317
H  0.29481818 -2.38066889 1.09527455
C  -1.70564498 -1.50263391 0.57022219
N  0.16777393 -0.49887266 0.10282269
N  -0.78260456 0.30072437 -0.34752526
N  -1.88691798 -0.32100605 -0.05643764
B  -3.14713762 -2.17425581 0.87331481
H  -3.12618631 -0.34853291 -0.08494558
H  -3.89485844 -1.02831288 0.24615269
H  1.60399996 0.79541706 -0.61976225
H  2.00030236 0.04789628 0.94881539
H  2.10605574 -0.91297992 -0.55357202
O  -3.49574968 -2.16831858 2.24580355
H  -4.33354581 -2.59447342 2.42479769
O  -3.42139346 -3.30989264 0.07315017
H  -4.25323336 -3.73153245 0.28746583
