program: Gaussian 16
title: Me_Ph-TS1
version: ES64L-G16RevC.01
method: RwB97XD
basis: GenECP
operation: Freq
keyword: #N
keyword: Geom=AllCheck
keyword: Guess=TCheck
keyword: SCRF=Check
keyword: GenChk
keyword: RwB97XD/GenECP
keyword: Freq
converged: YES YES YES YES
title: Mulliken charges:
elementType: H C C C C H C H C H B C C C C C C H H C C C C C C H H C H H H C H H H N H H H H H H H H
charge: 0.228886 -0.384273 -0.224189 -0.482180 0.134546 0.228824 -0.058274 0.232890 -0.110112 0.204222 -0.777233 0.105435 0.021531 -0.116264 -0.270553 -0.116286 -0.560679 0.238236 0.238632 0.470432 -0.347204 -0.143572 -0.254656 -0.315188 -0.489513 0.238918 0.239167 -0.462887 0.188816 0.201744 0.171846 -0.346254 0.144574 0.171689 0.199001 0.160746 0.137279 0.159915 0.210144 0.255740 0.228911 0.230011 0.206590 0.210594
chargesum: -0.00000
title: Mulliken charges with hydrogens summed into heavy atoms:
elementType: C C C C C C B C C C C C C C C C C C C C C N
charge: -0.155387 0.004635 -0.249290 0.134546 0.145948 -0.110112 -0.480040 0.105435 0.250442 0.139475 -0.032317 0.122345 -0.350535 0.470432 -0.117193 0.063018 -0.015738 -0.076021 -0.278919 0.099520 0.169010 0.160746
1716.lowfreq: -246.3670 -0.0002 0.0001 0.0003 3.1368 4.3682 7.5976 29.9843 39.4787
frequency: -246.3662 29.9641 39.4578 44.5192 57.2062 62.9499 70.9654 80.6370 126.1781 174.7585 200.5703 208.8597 224.0764 232.7606 254.0638 258.9837 273.8511 303.2731 357.0950 367.5528 408.3034 415.3118 455.5557 462.8868 489.7753 510.7556 547.2489 571.4714 583.3288 586.9241 626.8283 637.1643 640.1903 651.4379 659.3349 714.0313 724.4066 725.0886 764.9346 771.3962 779.0674 793.9133 808.8448 839.7973 880.8130 883.4213 895.2225 902.4730 917.9779 953.4443 961.1436 980.9288 987.1064 1010.3552 1016.1355 1020.3161 1022.4785 1023.4291 1024.9646 1027.8709 1061.5216 1064.9864 1073.9524 1077.5826 1110.3484 1110.9891 1117.3868 1123.5857 1168.8005 1174.6233 1181.7385 1184.0915 1184.6890 1189.3831 1200.5200 1217.2498 1219.1310 1243.6866 1247.4240 1258.0863 1300.3023 1310.7489 1317.7597 1319.0439 1343.5702 1360.5685 1362.5249 1447.1800 1471.1376 1473.6488 1476.6507 1481.9628 1484.3547 1496.3692 1501.5751 1519.7502 1528.4005 1533.8689 1536.2721 1637.2466 1640.4691 1642.0375 1668.1416 1669.4664 1671.3266 2979.4673 2988.6335 3084.8349 3089.7522 3135.4942 3156.6600 3163.7492 3170.6471 3172.1840 3176.8087 3179.1782 3185.0343 3185.8495 3188.5950 3194.3605 3196.8085 3197.1121 3207.6493 3207.9159 3209.3593 3614.3930
redmass: 1.6449 3.9335 4.2477 4.3924 3.9105 4.3752 4.1292 2.7319 3.3510 2.8628 3.7739 3.6405 2.4694 1.6686 3.3743 1.2095 3.2511 3.2223 3.3364 2.9098 2.8220 2.8351 3.0941 2.4768 3.0844 3.1641 1.7100 2.4985 2.4355 1.9677 4.7561 5.8647 6.3192 2.3809 3.5184 3.9227 1.5281 1.5073 2.8355 1.6835 2.9795 2.0616 2.6078 1.0893 1.2550 1.2490 1.9114 4.0461 2.5890 1.5178 1.4077 3.1965 1.3969 1.3916 1.3859 1.3252 5.8783 6.0626 1.3005 1.3032 2.4425 2.1306 1.5134 2.2339 1.7389 1.6466 1.5525 1.6215 2.0464 1.2528 1.7014 1.1367 1.1383 1.1442 1.6160 1.1391 1.1469 3.1439 3.5909 2.8299 1.8016 3.9684 4.9862 3.7585 2.6579 1.4779 1.4480 1.1575 1.3070 2.1311 2.0215 1.5875 1.1846 1.0586 1.0823 1.1333 2.2278 2.2113 2.2255 6.1087 5.3780 5.5036 5.9788 5.7302 5.7483 1.0528 1.0512 1.0834 1.0845 1.1036 1.1004 1.0879 1.0870 1.0871 1.0868 1.0866 1.0898 1.0884 1.0910 1.0945 1.0949 1.0933 1.0992 1.0992 1.0988 1.0093
irintensity: 346.5185 0.0027 0.0753 0.1839 1.7413 0.1015 0.1584 3.1218 0.5293 13.9224 4.8038 7.1581 4.0823 0.2192 5.0728 1.4437 11.2975 1.2174 1.9281 2.1453 0.4476 0.2331 13.2389 22.2848 2.2801 6.0943 43.4603 38.0654 74.3202 20.5229 9.4452 0.8263 0.6237 9.6994 20.6298 4.2603 61.6900 72.5248 16.5309 46.8161 29.5014 16.7949 11.8822 6.7036 0.6853 0.1852 17.6646 37.1085 21.7427 1.4818 0.1251 40.1655 0.2895 0.4793 0.5200 0.2005 0.3204 0.2433 0.0237 0.0242 1.3674 5.5871 14.4704 7.6582 8.7109 2.8635 2.7337 12.4679 0.2737 72.9961 5.1169 0.1479 0.3745 0.1613 8.7175 3.2338 3.8442 31.5781 70.1200 107.2385 9.4480 3.4692 10.0475 30.9713 23.6179 1.7107 1.1381 0.8581 11.1857 12.2906 19.3812 11.0091 13.2952 12.3554 17.6788 5.6645 57.6179 2.6183 1.5299 15.1599 0.3038 2.2210 14.3403 3.5699 0.3607 100.1739 137.5809 36.6677 31.3369 23.9756 8.5772 13.9070 8.5679 4.9616 4.4505 0.6639 3.1234 3.7580 6.6204 39.4911 41.7753 26.6538 41.0728 23.2585 23.8388 1103.9708
temp: 298.150 k
press: 1.00000 atm
elementType: 1 6 6 6 6 1 6 1 6 1 5 6 6 6 6 6 6 1 1 6 6 6 6 6 6 1 1 6 1 1 1 6 1 1 1 7 1 1 1 1 1 1 1 1
symmnumber: 1
zpe: 963786.0 jmol-1
zpe.correction: 0.367087 hartree
zpe.thermalcorrener: 0.386617 hartree
zpe.thermalcorrenthalpy: 0.387561 hartree
zpe.thermalcorrgfe: 0.318166 hartree
zpe.sumelectzpe: -854.506074 hartree
zpe.sumelectthermal: -854.486544 hartree
zpe.sumelectthermalent: -854.485600 hartree
zpe.sumelectthermalfe: -854.554995 hartree
dipole: 1.2314 -2.1689 0.6226
dipole: 2.5706
quadrupole: -114.5675 -132.2447 -127.8971
quadrupole: -8.2291 1.1729 0.1590
quadrupole: 10.3356 -7.3415 -2.9940 -8.2291 1.1729 0.1590
hfenergy: -854.873161 hartree
pointgroup: C01 [X(C20H22B1N1)]
dipole: 0.4844551 -0.8533035 0.2449427 debye
polarizability: 276.9262933|5.4542479|321.0444346|-35.7619213|0.6114781|280.9705566 unknown
InChI: InChI=1/C20H20BN.2H/c1-22(2)20-16-10-9-15-19(20)21(17-11-5-3-6-12-17)18-13-7-4-8-14-18;;/h3-16H,1-2H3;;
charge 0 multiplicity 1
44 atoms
H  0.36698422 0.3624736 0.1804875
C  1.44692356 0.26343623 0.18110702
C  2.24936288 1.38805998 0.03245065
C  2.0349657 -0.9847312 0.34608503
C  3.64665863 1.30318913 0.02193067
H  1.78067939 2.36217217 -0.06952574
C  3.41915169 -1.09726703 0.34967188
H  1.41978017 -1.86899381 0.47179565
C  4.21985066 0.03063747 0.17762609
H  3.87793159 -2.07175452 0.47887891
B  4.50482655 2.62512174 -0.22565198
C  4.05312685 3.94626188 0.54790554
C  4.12394604 5.20681278 -0.05534485
C  3.54307802 3.88284795 1.85286821
C  3.70087277 6.35473455 0.60924443
C  3.13031851 5.02333758 2.52871627
C  3.20620826 6.26585157 1.90452252
H  3.75912696 7.31874834 0.11511151
H  2.74417364 4.94629027 3.53958752
C  5.17897551 2.78914772 -1.66155492
C  4.47789646 2.37989585 -2.80133646
C  6.43649912 3.37194871 -1.85390099
C  5.00530695 2.5467845 -4.07824894
C  6.97948112 3.52853941 -3.12373891
C  6.2622028 3.11706893 -4.24291711
H  4.43816903 2.22242987 -4.94434817
H  7.96187016 3.97347107 -3.24197347
C  6.19994804 -0.47952523 -1.11856705
H  5.79472378 0.15350071 -1.90748859
H  7.2865573 -0.36148705 -1.10551503
H  5.96350747 -1.53052522 -1.34751238
C  6.21088022 -0.85639556 1.26990208
H  6.03539122 -1.93731258 1.16140131
H  7.29131468 -0.69512328 1.30782124
H  5.77718976 -0.52603685 2.21545066
N  5.65603374 -0.07087007 0.17515772
H  5.82630592 2.52347862 0.73471932
H  5.87046485 1.76127396 0.52064758
H  2.87918187 7.15873887 2.4265047
H  3.46663908 2.9177999 2.34594565
H  4.51011692 5.29279383 -1.06593288
H  3.50385151 1.91250786 -2.68874897
H  7.00935773 3.70420565 -0.99207008
H  6.68157739 3.23942549 -5.23563133
