program: Gaussian 16
title: MeQHBPh2 TS1
version: ES64L-G16RevC.01
method: RwB97XD
basis: GenECP
operation: Freq
keyword: #N
keyword: Geom=AllCheck
keyword: Guess=TCheck
keyword: SCRF=Check
keyword: GenChk
keyword: RwB97XD/GenECP
keyword: Freq
converged: YES YES NO NO
title: Mulliken charges:
elementType: C H C N N N B C H H H C C C C C C C C C C C C H H H H H H H H H H H H
charge: -0.245899 0.281103 -0.848041 0.384988 -0.215263 0.111595 -0.107789 -0.359095 0.217175 0.209265 0.210852 0.672881 -0.302771 -0.238422 -0.431467 -0.047566 -0.573562 0.113990 -0.189068 -0.094441 -0.259897 -0.199241 -0.462651 0.281618 -0.066103 0.193132 0.222286 0.207053 0.236041 0.222664 0.227456 0.227540 0.198423 0.234057 0.189156
chargesum: -0.00000
title: Mulliken charges with hydrogens summed into heavy atoms:
elementType: C C N N N B C C C C C C C C C C C C C
charge: 0.035204 -0.848041 0.384988 -0.215263 0.393212 -0.173892 0.278197 0.672881 -0.075316 -0.049265 -0.203927 0.186492 -0.375138 0.113990 0.046973 0.098691 -0.037232 0.023045 -0.255597
chargesum: 0.00000
1716.lowfreq: -1312.9299 -8.0937 -1.3611 -0.0007 -0.0006 -0.0004 7.6411 15.8312 31.5671
frequency: -1312.9299 15.7329 30.9099 40.4386 42.7531 65.8547 73.3866 82.5525 169.2934 205.8382 214.6877 237.5476 262.2869 295.4396 339.1349 403.4355 408.7916 415.1526 476.4077 489.2014 582.7206 637.0733 637.9838 659.9585 667.1055 678.9609 710.3262 723.0552 727.5143 733.6354 741.8920 776.6558 799.7566 837.4203 879.2247 881.1621 896.9775 922.1367 951.8625 953.9881 1009.0129 1010.7637 1021.3943 1022.2093 1022.5912 1024.3454 1057.2173 1064.6876 1068.0229 1076.0447 1082.8685 1108.0759 1111.5178 1127.4762 1153.3510 1171.5795 1182.8353 1183.5699 1192.1802 1199.6671 1215.8582 1219.0365 1242.0343 1307.8341 1315.1303 1324.4833 1339.6927 1359.6417 1361.7241 1396.8517 1452.7130 1471.7608 1476.1583 1478.6616 1488.4747 1513.9043 1533.1129 1534.8672 1597.6733 1639.2152 1641.7931 1668.5953 1669.3318 1780.0444 1865.1544 3082.2503 3159.8879 3167.9689 3168.1967 3170.9414 3172.1490 3183.0418 3183.5797 3191.4644 3192.2264 3195.8191 3205.3003 3205.8351 3298.6778
redmass: 1.1025 3.7448 1.2490 2.9217 4.0427 4.7178 4.0687 5.0878 3.9013 4.4042 3.9981 4.4679 5.7502 4.7466 6.5310 3.3191 2.8415 2.8664 3.6110 3.2160 3.9228 6.2329 6.2995 5.9231 3.5208 3.7775 2.0424 1.7157 1.4335 3.2666 3.4637 2.1946 2.6372 1.4308 1.2562 1.2548 4.4905 3.3097 1.5193 1.4997 1.3800 1.3860 1.9373 2.3795 6.0450 1.3026 3.3998 2.1310 2.3202 2.5865 2.0652 1.6589 1.6415 1.6358 1.3260 1.6935 1.1372 1.1333 1.0445 2.7627 1.1624 1.1567 3.5901 4.1051 4.2467 5.9243 4.2040 1.4854 1.4398 4.6650 1.5219 2.1020 2.1639 2.2156 1.0378 1.3042 2.1884 2.2241 5.2844 5.3142 5.5028 5.7481 5.7589 1.0761 1.0747 1.0328 1.0877 1.1070 1.0860 1.0874 1.0863 1.0901 1.0904 1.0946 1.0947 1.1055 1.0991 1.0991 1.1013
irintensity: 4835.4240 0.2265 0.7154 0.8233 0.1077 0.2788 3.6867 5.6832 0.8142 0.7473 0.7890 0.6781 0.8319 2.2689 0.2004 2.3197 0.0572 0.3893 5.4493 4.3089 12.3781 3.4638 0.3497 5.0477 6.7491 49.0470 5.9195 68.3938 28.3770 78.4736 22.9058 31.9525 19.5969 31.4840 1.2976 2.1008 93.2841 36.8214 4.7270 1.8929 0.6113 0.2656 0.0185 0.4053 0.6377 0.1709 11.1457 6.8320 21.1417 10.4647 18.5510 7.5530 8.1850 147.4076 0.8004 88.6530 0.4401 1.2335 24.8148 34.8347 0.2582 1.4793 110.2305 8.3234 7.9597 27.0215 41.8566 0.3285 0.1117 4.8905 10.4518 16.1870 9.9303 13.8677 16.6559 5.0083 1.6648 3.5783 0.6331 1.5858 0.6514 0.1102 0.1918 446.7634 409.5713 23.8543 15.7321 5.3105 9.6841 11.5472 2.5194 4.7418 5.7642 51.1068 51.6229 0.6094 38.2212 23.0014 2.7395
temp: 298.150 k
press: 1.00000 atm
elementType: 6 1 6 7 7 7 5 6 1 1 1 6 6 6 6 6 6 6 6 6 6 6 6 1 1 1 1 1 1 1 1 1 1 1 1
symmnumber: 1
zpe: 735875.4 jmol-1
zpe.correction: 0.280280 hartree
zpe.thermalcorrener: 0.296384 hartree
zpe.thermalcorrenthalpy: 0.297328 hartree
zpe.thermalcorrgfe: 0.233003 hartree
zpe.sumelectzpe: -769.908727 hartree
zpe.sumelectthermal: -769.892624 hartree
zpe.sumelectthermalent: -769.891680 hartree
zpe.sumelectthermalfe: -769.956005 hartree
dipole: -1.2427 6.2283 -1.2766
dipole: 6.4781
quadrupole: -124.0867 -96.9658 -112.6757
quadrupole: 15.2448 -5.1218 4.3726
quadrupole: -12.8440 14.2770 -1.4330 15.2448 -5.1218 4.3726
hfenergy: -770.1890074 hartree
pointgroup: C01 [X(C15H16B1N3)]
dipole: -0.488903 2.4503847 -0.5022593 debye
polarizability: 230.2258862|-41.8336947|224.6077871|0.4536011|-9.6897328|265.6394724 unknown
InChI: InChI=1/C15H16BN3/c1-19-12-15(17-18-19)16(13-8-4-2-5-9-13)14-10-6-3-7-11-14/h2-12,16-17H,1H3
charge 0 multiplicity 1
35 atoms
C  3.15861203 1.5920572 0.80728956
H  3.87826975 2.30302626 1.17609436
C  3.07125728 0.22442741 0.89109729
N  2.07072487 1.98354663 0.09187812
N  1.32328607 0.95674782 -0.27092379
N  1.93468738 -0.08381158 0.21569429
B  3.76037359 -1.13554359 1.40334702
C  1.68620536 3.3358908 -0.28007014
H  0.7840313 3.26853943 -0.88312148
H  1.4890562 3.92172647 0.61735922
H  2.48562635 3.79631509 -0.85962573
C  5.08695676 -1.54874022 0.60116989
C  5.04914605 -1.89548634 -0.75526822
C  6.34425163 -1.50806657 1.21477377
C  6.20528331 -2.19237764 -1.46746259
C  7.51005244 -1.79328013 0.50892627
C  7.44425147 -2.13910069 -0.8356402
C  3.71019213 -1.4313478 2.9736231
C  4.17783155 -2.65098209 3.48408625
C  3.19599612 -0.51164555 3.8939681
C  4.13262597 -2.93997921 4.84210765
C  3.15527415 -0.78552271 5.25889432
C  3.6223849 -2.00341982 5.7372217
H  2.13277868 -1.37981514 0.4282327
H  2.7675856 -1.99744786 0.86274822
H  2.81746415 0.44331469 3.54056839
H  2.75544681 -0.04887393 5.94813623
H  3.58992088 -2.2231914 6.79897028
H  4.58913018 -3.38818131 2.80035454
H  4.49844509 -3.89450467 5.20594526
H  4.09077909 -1.94156927 -1.26659094
H  6.14162778 -2.46728255 -2.5152601
H  8.34957211 -2.37001557 -1.38672543
H  8.47056003 -1.75195869 1.01223518
H  6.41447182 -1.25275958 2.26795235
