program: Gaussian 09
title: 000075771
version: EM64L-G09RevD.01
frameworkgroup: C1[X(C6H5N3O)]
method: RPBEPBE
basis: SDD
operation: Freq
keyword: #pfreq=noraman
keyword: PBEPBE/SDD
title: #p freq=noraman PBEPBE/SDD
converged: NO YES NO NO
title: Mulliken charges:
elementType: O N N N C C C C C C H H H H H
charge: -0.354394 -0.179924 -0.104829 -0.060549 0.348425 -0.024462 -0.321782 -0.273964 -0.185343 -0.216646 0.261120 0.256034 0.232664 0.233977 0.389673
chargesum: 0.00000
title: Mulliken charges with hydrogens summed into heavy atoms:
elementType: O N N N C C C C C C
charge: 0.035279 -0.179924 -0.104829 -0.060549 0.348425 -0.024462 -0.060662 -0.017930 0.047321 0.017331
polarizability: 1.25935990e+02 1.76408121e+00 9.72757489e+01 -3.86613923e-02 1.24649185e-02 3.43521550e+01
1716.lowfreq: -11.1663 -1.9957 -0.0007 -0.0007 -0.0006 8.4119 122.8711 166.4665 220.1217
frequency: 122.8444 166.4649 220.1215 232.1673 281.2521 426.4567 454.8224 507.4866 548.0837 575.6736 604.5371 690.3101 742.3832 761.9842 766.6267 858.3301 882.6186 933.9322 952.6947 986.8214 998.7670 1065.2162 1122.0017 1164.3967 1169.0103 1214.0394 1279.2334 1286.6244 1404.4350 1430.9246 1446.7555 1500.1468 1592.9257 1631.3521 3140.7273 3156.8158 3175.6605 3182.7114 3474.3131
redmass: 2.6789 1.4756 5.2266 5.5619 6.1959 2.9335 6.6111 7.2275 4.8613 7.1320 6.1759 8.6630 4.1625 1.3594 6.0274 1.3912 7.5849 6.5855 1.3601 1.3076 2.0502 6.5123 1.6397 1.5873 3.1423 2.7315 2.1265 1.5028 3.2404 2.1059 4.2755 3.2353 6.6159 7.0151 1.0865 1.0906 1.0961 1.0994 1.0657
irintensity: 67.1991 93.9341 5.4515 10.0790 2.1649 7.5183 7.2788 0.3409 0.3266 1.6609 0.0180 10.0879 9.5830 102.1775 4.0745 0.0377 2.2627 52.7701 2.3898 0.0185 5.4341 32.0478 3.4046 15.8438 7.3542 39.6548 103.8481 2.3045 8.7013 0.3437 0.7711 8.2982 1.8472 6.2627 4.4142 9.8164 8.4443 10.1854 69.8479
temp: 298.150 k
press: 1.00000 atm
elementType: 8 7 7 7 6 6 6 6 6 6 1 1 1 1 1
symmnumber: 1
zpe: 276048.3 jmol-1
zpe.correction: 0.105141 hartree
zpe.thermalcorrener: 0.112893 hartree
zpe.thermalcorrenthalpy: 0.113837 hartree
zpe.thermalcorrgfe: 0.072720 hartree
zpe.sumelectzpe: -470.318062 hartree
zpe.sumelectthermal: -470.310310 hartree
zpe.sumelectthermalent: -470.309366 hartree
zpe.sumelectthermalfe: -470.350483 hartree
dipole: -1.0752 -2.7424 -0.0031
dipole: 2.9457
quadrupole: -44.4002 -60.5815 -60.1704
quadrupole: -4.6686 -0.0203 0.0205
quadrupole: 10.6505 -5.5308 -5.1197 -4.6686 -0.0203 0.0205
hfenergy: -470.4232029 hartree
pointgroup: C01 [X(C6H5N3O1)]
dipole: 0.4906092 -1.0499453 0.003225 debye
dipolederiv: -0.5966787 -0.388255 -0.0204498 -0.4171402 -0.3876134 -0.0158256 -0.0255349 -0.0192985 -0.3054115 0.3923115 0.5068429 0.02824 0.3688893 0.0053744 0.0169578 0.0338103 0.0276092 -0.0007843 -0.1693893 -0.4768784 -0.0076338 -0.0527273 -0.2941156 -0.0040493 -0.0008436 -0.0216963 -0.1742214 -0.4438817 0.1740973 -0.0086044 -0.0323733 0.5320622 0.0079843 -0.0152541 0.0168148 -0.1623236 0.3036903 -0.0253872 0.0059471 -0.0415569 -0.1888607 -0.007321 0.0050447 -0.0071703 0.1123777 0.032299 0.1310967 0.0013657 -0.08897 -0.131519 -0.006141 -0.0018645 0.0024991 0.0371199 -0.0670777 -0.0643082 0.0027778 -0.0006474 0.0828021 0.0034888 0.0035575 0.0008639 -0.1589929 0.117252 -0.0709728 0.0082639 0.0426982 0.1387468 0.0058329 0.0100778 0.0012033 -0.1170648 -0.0013784 0.0003039 0.0055309 -0.066272 0.1817469 0.0027703 0.0049798 0.0055694 -0.1470795 0.056969 0.1084023 0.010745 0.1418445 -0.1653653 0.0059774 0.0111336 0.0043927 -0.1733357 0.0755841 -0.0525316 -0.0054019 -0.0117145 -0.0266128 -0.0037928 -0.0048666 -0.0054538 0.1899765 0.0818609 -0.020481 -0.0037598 -0.0568838 -0.0309953 -0.0055239 -0.0040797 -0.0039202 0.1674622 -0.010826 0.103861 -0.0050585 0.0993599 -0.0093922 0.0012081 -0.0050701 0.0013957 0.158663 -0.1073438 -0.0480308 -0.0115607 -0.0393041 0.0813952 -0.0029244 -0.0114077 -0.0032931 0.1651131 0.3366087 0.1222409 -0.0004016 0.1547977 0.2123466 0.0013584 0.0003176 0.0004842 0.4085013 unknown
polarizability: 125.8934275|0.0133983|97.1495356|3.7130993|1.0691586|34.5209312 unknown
InChI: InChI=1S/C6H5N3O/c10-9-6-4-2-1-3-5(6)7-8-9/h1-4,10H
charge 0 multiplicity 1
15 atoms
O  -2.426868 -1.511643 -0.186418
N  -1.540525 -0.408896 -0.123163
N  -0.94124 1.718065 -0.064771
N  -2.023423 0.91277 -0.123399
C  -0.165154 -0.480552 -0.068935
C  0.212258 0.905973 -0.031451
C  0.776711 -1.535612 -0.048841
C  1.581959 1.267305 0.029119
C  2.127195 -1.151026 0.010864
C  2.525169 0.226727 0.049001
H  0.470289 -2.584373 -0.077376
H  1.878277 2.319863 0.057996
H  2.901422 -1.925669 0.028955
H  3.592489 0.46682 0.094872
H  -3.331158 -1.086153 -0.213354
