program: Gaussian 09
title: product2.5
version: ES64L-G09RevD.01
method: RB3LYP
basis: 6-31+G(d,p)
operation: Freq
keyword: #P
keyword: Geom=AllCheck
keyword: Guess=TCheck
keyword: SCRF=Check
keyword: GenChk
keyword: RB3LYP/6-31+G(d,p)
keyword: Freq
converged: YES YES NO YES
title: Mulliken charges:
elementType: O C O C C C C C F F F C C C C C N C C C C C C C C C H H H H H H H H H H H H H H H H
charge: -0.494344 0.768741 -0.258121 -0.158443 -0.508479 -0.765282 0.286329 0.792718 -0.285385 -0.324431 -0.314450 0.120383 -0.327813 -0.809136 0.974922 -0.441354 -0.552171 -0.051865 0.114137 0.215928 0.215980 -0.133365 -0.107542 -0.141096 -0.114882 -0.410941 0.170469 0.175137 0.173060 0.192351 0.168406 0.208971 0.168209 0.177613 0.173793 0.162140 0.170621 0.148399 0.152726 0.155904 0.157354 0.154811
chargesum: 0.00000
title: Mulliken charges with hydrogens summed into heavy atoms:
elementType: O C O C C C C C F F F C C C C C N C C C C C C C C C
charge: -0.494344 0.768741 -0.258121 0.360223 -0.508479 -0.404525 0.495301 0.792718 -0.285385 -0.324431 -0.314450 0.120383 -0.159605 -0.631524 0.974922 -0.441354 -0.552171 0.121928 0.276277 0.386550 0.215980 0.015034 0.045184 0.014808 0.042472 -0.256131
polarizability: 3.27389803e+02 2.62473406e+01 3.18702063e+02 -4.24073887e+01 1.02216611e+02 4.21810891e+02
1716.lowfreq: -18.8987 -16.5831 -14.4852 -0.0005 -0.0004 -0.0002 14.3346 34.5046 42.8941
frequency: 10.6710 34.4604 42.7718 51.2971 58.8180 65.1048 68.7117 80.0257 101.3713 116.1509 120.3332 120.8382 132.5403 155.9238 172.8538 197.5114 220.2078 266.9656 272.8714 287.1873 290.4141 312.1534 339.8401 359.6529 403.9490 407.8486 416.4304 474.0519 485.4118 501.9709 515.1333 527.9527 543.9849 566.3870 572.4822 583.1991 621.8262 630.7536 657.4612 679.7644 694.9160 707.8325 742.7630 753.6992 767.5905 791.5625 802.8877 843.3426 844.4486 848.8330 854.5050 861.2702 872.1370 932.2992 959.8692 971.6645 977.0092 992.3030 992.4117 993.6284 1010.0809 1014.7580 1017.9598 1039.5054 1052.1806 1071.5937 1096.8496 1106.3153 1122.8407 1148.6556 1170.9856 1174.8296 1197.4725 1203.6691 1207.6831 1218.7257 1220.6725 1228.5494 1235.9094 1252.0370 1279.0664 1307.7090 1339.2893 1340.9308 1345.3227 1360.2507 1368.0466 1404.3690 1413.1636 1456.4188 1469.0053 1473.6789 1474.8666 1477.1707 1483.9803 1528.9641 1544.6998 1608.3865 1620.1196 1647.5921 1657.5248 1676.4659 1741.6648 2323.7437 3068.9068 3090.2013 3125.4801 3151.1838 3168.3690 3181.3331 3186.3545 3188.3948 3192.3459 3200.6744 3205.0512 3210.3952 3217.6029 3220.2354 3225.9359 3241.4764
redmass: 7.3999 6.2593 4.4813 6.4652 4.3220 4.5034 4.3233 7.3064 6.5341 3.8452 2.7141 2.3663 7.2296 5.7512 5.0034 5.2481 5.7251 6.2862 5.6750 9.3052 8.4700 4.0500 4.6800 2.8710 4.1171 2.9813 2.9824 8.8029 5.0926 4.0683 4.7125 7.3542 10.1016 7.7529 4.3626 5.2280 4.9152 6.1862 6.7496 3.8818 6.3531 1.7520 4.3343 3.1173 3.0095 5.7743 4.0696 2.1239 3.8587 1.3393 3.5634 1.2762 3.4018 1.4111 1.7985 2.4212 1.4568 1.9064 1.5147 1.7371 1.2918 5.4526 4.3760 2.8778 2.1751 5.0430 5.0161 2.0238 2.7173 1.3768 1.2796 1.0830 1.2821 1.4539 1.4383 1.9487 2.4799 2.5238 2.1866 1.7840 3.0672 1.8571 4.3006 1.6370 2.4685 1.4624 1.6664 1.7954 1.8148 2.3527 1.1064 1.0962 1.0956 1.7954 1.2326 2.2264 2.4066 6.2253 5.3913 5.6564 5.8260 7.8553 10.9887 12.6818 1.0298 1.0845 1.0668 1.1079 1.0877 1.1068 1.0877 1.0954 1.0897 1.0931 1.0899 1.0969 1.0916 1.0939 1.0953 1.0934
irintensity: 0.2671 1.1133 1.5890 0.6962 2.0667 0.5362 0.2729 2.1697 2.1251 7.7912 1.0189 6.9184 2.3316 5.4823 2.9813 2.0549 2.8780 7.2057 3.6083 0.8449 0.9314 6.9780 16.5550 11.5346 11.6297 0.8023 6.9295 6.1993 10.4113 4.9583 38.9856 6.0393 0.7664 2.1907 28.3892 11.4352 47.3767 3.5954 3.9132 1.2023 10.1845 76.2982 1.0417 19.8825 26.6040 3.6299 118.6265 29.8904 14.0589 1.3891 30.0614 0.2385 26.5359 6.4162 35.5954 65.1177 6.0892 2.6742 0.4146 2.6250 0.6632 6.0715 77.3374 14.5246 6.4521 371.5789 403.9403 52.0907 119.6047 19.6627 2.7249 0.8016 23.1602 4.0438 9.0923 109.9805 50.9638 399.7216 10.1319 76.5360 699.6028 118.9676 22.1144 28.5730 21.5999 2.0360 1.5097 1.8150 42.9962 10.3041 28.9230 26.3138 8.3596 0.6547 56.3565 25.6564 14.4301 0.6363 3.4366 0.4726 36.5822 228.4104 343.3054 273.8471 49.4230 6.8886 15.7335 24.9334 0.7021 16.7391 4.1241 1.3066 2.4519 26.1843 4.8995 30.3670 1.3410 9.3188 1.9610 0.4902
temp: 298.150 k
press: 1.00000 atm
elementType: 8 6 8 6 6 6 6 6 9 9 9 6 6 6 6 6 7 6 6 6 6 6 6 6 6 6 1 1 1 1 1 1 1 1 1 1 1 1 1 1 1 1
symmnumber: 1
zpe: 835471.3 jmol-1
zpe.correction: 0.318214 hartree
zpe.thermalcorrener: 0.341659 hartree
zpe.thermalcorrenthalpy: 0.342603 hartree
zpe.thermalcorrgfe: 0.262756 hartree
zpe.sumelectzpe: -1276.366716 hartree
zpe.sumelectthermal: -1276.343271 hartree
zpe.sumelectthermalent: -1276.342327 hartree
zpe.sumelectthermalfe: -1276.422174 hartree
dipole: -5.4537 -3.3195 -3.3755
dipole: 7.2219
quadrupole: -160.4690 -160.4646 -196.1012
quadrupole: -0.6582 -32.6852 -15.7070
quadrupole: 11.8759 11.8803 -23.7563 -0.6582 -32.6852 -15.7070
hfenergy: -1276.6849299 hartree
pointgroup: C01 [X(C20H16F3N1O2)]
dipole: -2.1456365 -1.3059898 -1.3280424 debye
polarizability: 327.389803|26.2473406|318.7020635|-42.4073887|102.2166105|421.8108907 unknown
InChI: InChI=1/C20H16F3NO2/c1-26-19(25)17(11-14-5-3-2-4-6-14)12-18(20(21,22)23)16-9-7-15(13-24)8-10-16/h2-11,18H,12H2,1H3
charge 0 multiplicity 1
42 atoms
O  2.93050839 1.15669765 -0.16162065
C  2.09568028 0.29274757 0.06616012
O  1.87211638 -0.74136796 -0.76612826
C  2.71528086 -0.82712803 -1.9330469
C  1.19155489 0.25393244 1.25633779
C  0.55928928 -1.06235271 1.64370889
C  1.40836753 -1.94825081 2.61383071
C  2.56819689 -2.66070327 1.93774685
F  3.50502211 -1.83994034 1.39036479
F  3.23643825 -3.46569391 2.8110589
F  2.13635534 -3.46722028 0.93284487
C  1.79721626 -1.20095899 3.87528581
C  2.94920641 -0.40806736 3.97741464
C  3.20502868 0.32505353 5.13216003
C  2.29368677 0.283117 6.19859812
C  2.52786041 1.07080644 7.36908946
N  2.71032098 1.72008097 8.31851095
C  1.13354972 -0.50355596 6.10785696
C  0.90074133 -1.24015454 4.95285143
C  1.06360356 1.42071724 1.92679109
C  0.24445487 1.74742467 3.1041363
C  0.80127286 2.60329339 4.07288332
C  0.09010094 2.94282229 5.22341358
C  -1.20735556 2.45896575 5.41285814
C  -1.79007597 1.64454208 4.43619547
C  -1.07265927 1.28987072 3.29414327
H  2.41615011 -1.74525957 -2.4382064
H  3.76675398 -0.8764803 -1.64149625
H  2.55263329 0.03442559 -2.58510189
H  0.32203373 -1.65119781 0.75680609
H  -0.37648997 -0.89300929 2.1694456
H  0.74929286 -2.77079064 2.90773974
H  3.65095265 -0.34329249 3.15553003
H  4.09432546 0.94166968 5.20235585
H  0.42664236 -0.52740463 6.92970213
H  0.00095693 -1.84289133 4.87740217
H  1.68353214 2.24024503 1.5687029
H  1.80790027 2.98406914 3.92752221
H  0.54842646 3.58467102 5.96977861
H  -1.76472487 2.7243193 6.30639628
H  -2.80784975 1.28675882 4.56192172
H  -1.55068887 0.68068788 2.53555855
