program: Gaussian 09
title: intermediate enolate gamma alkylation
version: ES64L-G09RevD.01
method: RB3LYP
basis: 6-31+G(d,p)
operation: Freq
keyword: #P
keyword: Geom=AllCheck
keyword: Guess=TCheck
keyword: SCRF=Check
keyword: GenChk
keyword: RB3LYP/6-31+G(d,p)
keyword: Freq
converged: YES YES NO YES
title: Mulliken charges:
elementType: C C C O C O C H C H C F F F C C C C C N C C C C C C C C H H H H H H H H H H H H H H N C C C C N C C H H H H H H H H H H H H
charge: -0.426522 -0.929915 0.513888 -0.253702 -0.186423 -0.540126 -0.108544 0.171171 -1.056213 0.186567 1.329960 -0.277124 -0.312649 -0.273843 0.026176 0.214024 -0.114849 0.600465 -0.119433 -0.666128 -0.290527 -0.070560 0.749992 -0.052195 -0.321936 -0.286609 0.158659 -0.515015 0.185207 0.179288 0.144645 0.144200 0.148396 0.158251 0.180878 0.181604 0.162943 0.135237 0.146253 0.151231 0.151162 0.142721 -0.353354 0.230627 -0.352967 -0.211619 -0.420791 -0.239805 -0.363204 0.108492 0.204539 0.199075 0.171910 0.171542 0.207550 0.195669 0.172359 0.173458 0.173899 0.172685 0.201362 0.197970
chargesum: 0.00000
title: Mulliken charges with hydrogens summed into heavy atoms:
elementType: C C C O C O C C C F F F C C C C C N C C C C C C C C N C C C C N C C
charge: -0.062027 -0.929915 0.513888 -0.253702 0.250817 -0.540126 0.062626 -0.869647 1.329960 -0.277124 -0.312649 -0.273843 0.026176 0.372275 0.066030 0.600465 -0.119433 -0.666128 -0.108922 0.092384 0.749992 0.083041 -0.175683 -0.135378 0.309821 -0.372294 -0.353354 0.634241 -0.009515 0.191600 -0.074974 -0.239805 -0.016621 0.507823
polarizability: 5.47502140e+02 -6.37693380e+00 4.41613828e+02 -1.66147585e+01 -3.25996601e+01 4.48935863e+02
1716.lowfreq: -15.5256 -11.9007 -9.3483 -0.0061 -0.0004 0.0006 11.2132 13.0750 21.2279
frequency: 10.5338 12.3336 19.7873 29.4968 38.7545 45.7187 48.4990 53.5688 63.3735 81.2224 82.6223 91.1038 94.6373 110.0517 128.8385 131.7691 147.1712 153.0590 173.0042 181.6244 189.0729 219.9647 247.5940 267.3797 270.2835 278.0561 296.6855 307.9364 311.7349 338.9513 358.7894 361.7552 381.9998 410.1122 415.7603 433.2009 438.3059 463.9486 484.4450 496.3847 503.1174 536.3834 544.4283 567.4101 574.1610 577.9248 581.9859 595.4602 608.5126 619.6029 634.6814 657.8394 674.2879 680.7627 684.4196 712.6569 741.6620 753.5663 762.7946 770.7046 787.1911 807.0819 817.0324 826.3472 833.6659 846.4958 850.9301 854.0151 858.3617 860.2464 874.1364 887.5825 909.9405 934.7121 953.5118 973.6088 980.5769 988.7960 990.0348 994.9762 996.2116 1003.0375 1015.4434 1019.4950 1030.6513 1037.1604 1037.2210 1041.5707 1043.1417 1053.2629 1066.4297 1077.0526 1077.9015 1099.0838 1104.8102 1115.6666 1143.5241 1171.0141 1175.2446 1194.4668 1200.0607 1201.5591 1202.6704 1208.9236 1210.9392 1213.5459 1216.6768 1230.4284 1235.0725 1248.9373 1254.6179 1270.2825 1283.1162 1307.0183 1317.8507 1325.4649 1337.1952 1339.2292 1344.8837 1347.9066 1350.9467 1352.3944 1361.9742 1362.5824 1364.9614 1377.0143 1382.6069 1387.4369 1394.3169 1396.3237 1417.7097 1435.8147 1449.3079 1463.4521 1469.0635 1475.1666 1483.2206 1485.2850 1486.4069 1492.4788 1494.0328 1494.5159 1499.2534 1509.0568 1529.6205 1540.8398 1607.2252 1624.2526 1628.7383 1647.0959 1653.6577 2321.5560 3035.2608 3073.2719 3073.7678 3074.8362 3078.5533 3093.8007 3101.1497 3101.9804 3110.0573 3122.2025 3123.0487 3124.5975 3125.9749 3126.2591 3131.7482 3138.1570 3163.6594 3176.7104 3182.5757 3188.2501 3191.5652 3192.9044 3197.6006 3202.5143 3208.9983 3213.2522 3221.6336 3226.0779
redmass: 6.6025 5.3267 2.7890 6.9311 3.1677 3.5688 5.3984 6.3957 4.1525 3.9409 4.9331 5.1181 6.7442 6.9439 6.7730 6.3630 3.7526 3.6173 4.8989 1.3898 5.4531 5.1424 5.5568 3.7922 4.7248 6.9579 10.5262 2.2756 8.3576 2.3575 3.1345 4.7254 2.3685 2.8794 2.8958 2.5237 2.2672 5.0918 7.4946 6.6156 5.2130 7.9398 7.5696 7.8445 3.9169 3.8965 3.7840 5.4400 5.6549 4.6287 6.1739 6.6735 5.1462 5.9321 7.3677 1.6717 4.7251 5.6722 3.2207 5.1814 4.0963 4.7981 4.4912 2.9148 1.1713 1.3746 1.2627 2.0254 1.5218 1.2748 3.3810 3.2388 2.6502 1.6259 3.1375 2.5940 1.6930 1.5244 2.1382 1.5662 3.1114 1.2838 5.8826 5.3553 3.4309 3.0225 3.0080 1.6251 2.5063 2.2295 4.6188 2.9418 2.9063 8.7062 2.5344 3.1132 1.3862 1.0823 1.2705 1.4594 1.3774 1.2947 1.6564 1.9546 1.1135 1.9024 2.4696 2.8131 4.0747 2.3558 1.6716 1.0935 2.1828 1.5724 1.9295 1.3013 1.9059 1.3171 1.2696 1.2778 1.8752 1.3672 2.2041 1.3925 1.3510 1.3772 1.8136 1.3843 1.3376 1.5109 1.6377 1.3754 2.5444 1.1930 1.0524 1.1896 2.1324 1.0873 1.0802 1.0778 1.0944 1.0824 1.0890 1.0922 2.1851 2.3870 6.2112 7.8548 6.3847 5.6856 5.8584 12.6825 1.0313 1.0587 1.0583 1.0588 1.0607 1.0839 1.1051 1.0588 1.0830 1.0748 1.0977 1.0978 1.0691 1.1053 1.1041 1.1072 1.1096 1.0862 1.0878 1.1090 1.0927 1.1100 1.0907 1.0941 1.0956 1.0893 1.0950 1.0958
irintensity: 0.5086 0.8070 0.1960 1.9806 0.1784 0.1829 0.4015 1.4716 1.9588 0.2231 3.4720 5.9078 4.5464 8.9281 8.0809 4.3145 6.6695 1.3718 6.2421 2.1908 3.4803 6.3601 3.9200 14.0173 0.7370 0.2745 0.1644 5.5000 0.5839 2.0109 19.7975 30.5524 4.6012 0.1282 0.5329 2.3932 0.7476 1.7585 7.0179 28.1858 3.3361 34.8128 73.4142 2.5130 11.0012 3.4001 0.7148 22.6686 99.7088 25.5195 6.0031 9.5194 14.2822 37.4808 6.7849 96.7226 14.2548 80.3320 34.4978 13.5321 241.6347 52.1349 78.4456 165.8099 3.9069 26.0419 0.2636 1.1012 28.1431 3.5982 41.1796 26.7174 14.2179 8.0570 10.8872 10.8646 11.8131 2.5171 12.0060 13.1146 70.2976 0.8189 7.6357 11.4404 45.3612 14.1973 14.6506 3.9073 22.4767 10.2592 409.9983 35.3783 49.2306 551.7078 146.1384 198.2660 16.5162 0.2498 2.9807 115.7346 22.5715 5.0233 17.3304 8.1506 4.2224 16.4976 7.5389 19.5135 312.2677 26.0023 236.4797 0.4444 8.0918 32.9213 33.7149 27.9992 7.7688 4.8685 4.5634 5.4501 66.7553 7.1574 1.6148 3.3933 2.4205 35.1463 13.8617 40.7902 31.8384 86.8431 18.3558 76.2965 18.2905 11.0336 11.6995 39.7131 7.5040 1.4437 0.6946 23.3478 8.7485 27.6670 2.8941 25.5175 24.1257 16.3206 2.3767 988.7655 363.2458 14.4378 103.3969 332.1083 121.4118 66.8474 91.5410 19.9988 67.8276 7.9161 66.1314 38.1620 18.6335 20.4724 1.9811 37.0621 3.5673 22.0075 45.1714 13.4255 23.2588 7.2466 1.0771 13.4417 33.1264 14.5669 4.3941 45.7757 11.9702 1.6247 4.3179 2.2138
temp: 298.150 k
press: 1.00000 atm
elementType: 6 6 6 8 6 8 6 1 6 1 6 9 9 9 6 6 6 6 6 7 6 6 6 6 6 6 6 6 1 1 1 1 1 1 1 1 1 1 1 1 1 1 7 6 6 6 6 7 6 6 1 1 1 1 1 1 1 1 1 1 1 1
symmnumber: 1
zpe: 1327966.2 jmol-1
zpe.correction: 0.505796 hartree
zpe.thermalcorrener: 0.536523 hartree
zpe.thermalcorrenthalpy: 0.537467 hartree
zpe.thermalcorrgfe: 0.439543 hartree
zpe.sumelectzpe: -1621.567071 hartree
zpe.sumelectthermal: -1621.536344 hartree
zpe.sumelectthermalent: -1621.535400 hartree
zpe.sumelectthermalfe: -1621.633324 hartree
dipole: 8.4951 -15.7083 5.2041
dipole: 18.6010
quadrupole: -194.6062 -225.8829 -183.8347
quadrupole: -36.3854 30.1664 -20.1116
quadrupole: 6.8351 -24.4416 17.6066 -36.3854 30.1664 -20.1116
hfenergy: -1622.072867 hartree
pointgroup: C01 [X(C26H28F3N3O2)]
dipole: 3.3422123 -6.1801106 2.0474425 debye
polarizability: 547.5021395|-6.3769338|441.6138284|-16.6147585|-32.5996601|448.9358629 unknown
InChI: InChI=1/C26H28F3N3O2/c1-34-25(33)22(18-32-14-11-31(12-15-32)13-16-32)23(20-5-3-2-4-6-20)24(26(27,28)29)21-9-7-19(17-30)8-10-21/h2-10,23-24H,11-16,18H2,1H3
charge 0 multiplicity 1
62 atoms
C  4.90679612 -0.36952438 1.58200447
C  4.38223538 0.51594531 0.53331166
C  5.2517801 1.28314696 -0.26788409
O  6.60511617 1.07212335 0.02133187
C  7.54117868 1.63351268 -0.89470527
O  4.95509074 2.10069673 -1.16869787
C  2.9217731 0.9394849 0.52343497
H  2.85450222 1.66902647 -0.2860363
C  2.44177263 1.6751196 1.82538061
H  2.52619429 1.00290994 2.68395395
C  3.32066019 2.86158647 2.20648256
F  3.50931651 3.75002273 1.19813701
F  2.76647557 3.57732923 3.23597947
F  4.55283048 2.50365859 2.64814767
C  0.99381763 2.13459317 1.72809877
C  0.09461664 1.83065432 2.75941719
C  -1.23743167 2.2234996 2.68924936
C  -1.68657278 2.93898063 1.56580949
C  -3.05567052 3.34499324 1.48070018
N  -4.17054647 3.67520278 1.41247483
C  -0.79536584 3.25416377 0.52566104
C  0.53314408 2.85100383 0.61381737
C  1.95227279 -0.1837127 0.17189748
C  1.29210907 -0.96424588 1.1297139
C  0.47210027 -2.0316095 0.74989392
C  0.29286719 -2.33806172 -0.60075394
C  0.93673487 -1.55868433 -1.56960609
C  1.7518166 -0.49411402 -1.18267197
H  5.84757165 -0.0237286 2.01478148
H  4.18573816 -0.54397312 2.38391653
H  7.39014642 1.2488881 -1.9097617
H  8.52834319 1.33093344 -0.53587047
H  7.48191809 2.7263542 -0.91932239
H  0.44119994 1.27322634 3.62413737
H  -1.92728547 1.98132885 3.49033427
H  -1.1459185 3.80582922 -0.33990774
H  1.208682 3.09225886 -0.19904604
H  1.42248673 -0.75934359 2.18692438
H  -0.02248347 -2.62559853 1.51373752
H  -0.34324925 -3.16733714 -0.89657161
H  0.80003244 -1.77839027 -2.62501552
H  2.25380895 0.10253107 -1.94002323
N  5.29555098 -1.86955633 1.17534253
C  6.32271413 -1.89013506 0.07676371
C  6.69954058 -3.36331861 -0.23584477
C  4.08948736 -2.64366185 0.72757934
C  4.51209611 -4.09505822 0.37823184
N  5.94855641 -4.30050204 0.61306485
C  6.24716872 -4.01090298 2.02359468
C  5.87486272 -2.54759521 2.38744443
H  7.17110685 -1.30580971 0.42718694
H  5.87555309 -1.38002691 -0.77558037
H  7.76749561 -3.52118172 -0.06475752
H  6.48159521 -3.59484388 -1.28161668
H  3.67365591 -2.1125704 -0.12582742
H  3.3761107 -2.61028325 1.54896422
H  4.30014984 -4.30767432 -0.67273025
H  3.95283864 -4.80606897 0.99168653
H  7.31317797 -4.18073628 2.19403933
H  5.68358873 -4.70940651 2.64710932
H  6.74504451 -1.96377679 2.69165316
H  5.11742183 -2.49475414 3.1714537
