program: Gaussian 09
title: fluoride liberation TS
version: ES64L-G09RevD.01
method: RB3LYP
basis: 6-31+G(d,p)
operation: Freq
keyword: #P
keyword: Geom=AllCheck
keyword: Guess=TCheck
keyword: SCRF=Check
keyword: GenChk
keyword: RB3LYP/6-31+G(d,p)
keyword: Freq
converged: YES YES YES YES
title: Mulliken charges:
elementType: F C C C O C O C C C C C C C H H H H H H H H H H H N C C C C N C C H H H H H H H H H H H H
charge: -0.528119 0.378780 -0.566335 0.853977 -0.293305 -0.163804 -0.572371 -0.512371 -0.504309 -0.200591 -0.184439 -0.083097 -0.229645 0.311724 0.165779 0.158959 0.160200 0.156625 0.184880 0.194124 0.150265 0.157402 0.155006 0.153406 0.157493 -0.398844 0.019848 -0.339513 0.118869 -0.455316 -0.249232 -0.362638 -0.149005 0.204711 0.206799 0.175330 0.177559 0.212223 0.208648 0.174518 0.177354 0.176530 0.174381 0.200662 0.226885
chargesum: 0.00000
title: Mulliken charges with hydrogens summed into heavy atoms:
elementType: F C C C O C O C C C C C C C N C C C C N C C
charge: -0.528119 0.544558 -0.566335 0.853977 -0.293305 0.311980 -0.572371 -0.133367 -0.504309 -0.050326 -0.027037 0.071909 -0.076239 0.469217 -0.398844 0.431358 0.013376 0.539740 -0.103444 -0.249232 -0.011727 0.278542
polarizability: 3.14604241e+02 -1.22310593e+01 3.07503370e+02 1.86414264e+01 -3.88571134e+01 3.18382037e+02
1716.lowfreq: -289.6319 -23.9988 -15.5594 -11.5489 0.0006 0.0007 0.0008 19.5659 29.3630
frequency: -289.6314 14.1321 29.0375 47.4118 55.7780 69.5415 83.4161 97.0191 110.3617 124.5279 157.0062 174.9512 180.9854 200.8834 224.6050 269.9255 275.2697 313.4985 340.9999 361.9478 375.3084 395.9393 413.6253 429.6263 438.9884 470.4415 522.2232 571.2470 572.8536 580.2345 595.5672 616.6092 634.0756 697.7326 706.0666 714.3819 762.6233 784.2774 803.1405 829.1728 836.3450 846.5889 847.6891 858.3627 863.0439 863.4995 909.0678 940.7782 960.2738 985.4470 993.8152 1000.0965 1008.1603 1010.4136 1014.1974 1036.9199 1040.0148 1040.8738 1049.8929 1060.3272 1073.6911 1076.5381 1093.9115 1126.2048 1144.9711 1170.5653 1173.6067 1188.5417 1203.3238 1207.2475 1211.0022 1214.4554 1217.3143 1257.3754 1275.0986 1296.0505 1326.5370 1328.9505 1335.4879 1345.9523 1351.2458 1353.0636 1355.2834 1357.8320 1366.7865 1370.0555 1384.6891 1403.9126 1405.7583 1443.3175 1463.9573 1471.3978 1473.7541 1475.5504 1476.9483 1486.5323 1486.9950 1489.0750 1495.4363 1496.0098 1506.1581 1520.6893 1527.3176 1622.9160 1648.4880 1672.2802 3054.8975 3077.0741 3077.9418 3081.2946 3094.4123 3097.5039 3103.7031 3123.0236 3127.2917 3128.8352 3129.1793 3129.3444 3157.4046 3160.7807 3166.3230 3169.7237 3174.0599 3180.8339 3186.4434 3188.9538 3195.4635 3206.5752 3243.1286
redmass: 13.5603 3.5109 3.9801 4.3931 2.9148 4.5121 4.0279 1.9325 4.7696 2.9781 3.9929 4.3094 1.7845 4.3038 7.7410 3.9491 5.5767 2.1713 2.2947 2.8802 5.2727 2.6555 2.9201 2.5259 2.3779 3.1881 4.9919 3.8387 4.2339 3.9646 6.1273 5.7665 6.4040 4.5449 4.2616 1.7619 2.1746 8.6099 3.5601 1.3268 4.8702 1.4964 3.0597 2.2265 1.5068 1.6044 2.2199 1.5178 2.9131 2.6976 1.3635 3.4549 1.3187 3.9002 6.1540 3.1064 2.7051 1.9777 2.0820 2.5780 2.9027 2.9085 1.5362 3.7589 1.1819 1.0829 1.2738 1.1250 1.8815 1.5905 1.9959 2.1912 1.0620 1.7413 1.0995 1.4086 1.6878 1.2384 1.2812 1.2919 2.7389 3.2335 1.3306 1.3105 1.3708 1.3407 1.3586 1.4927 1.3194 1.4098 2.3115 1.8056 1.2514 1.0816 1.0857 1.2720 1.0868 1.0866 1.0941 1.0865 1.0830 1.0875 2.4591 5.7006 5.9549 10.9820 1.0300 1.0589 1.0589 1.0609 1.0614 1.0605 1.0597 1.0637 1.1078 1.1091 1.1070 1.1056 1.1055 1.1076 1.1093 1.1104 1.0873 1.0862 1.0890 1.1102 1.0934 1.0978 1.0921
irintensity: 744.9354 1.1748 0.6164 1.8380 2.0088 2.4100 9.8059 0.1563 7.2773 8.2086 2.7763 16.7174 6.0657 3.8457 10.6991 15.0006 4.5002 12.2698 10.7749 21.8328 11.5918 1.0019 0.2679 4.9292 0.2418 6.2110 85.1323 9.9389 41.3834 11.0115 62.5503 23.3956 8.4669 4.4006 19.4560 64.2424 75.4424 49.0131 20.3928 5.8753 28.4921 27.0263 8.0788 123.5193 36.0812 51.5162 48.7926 9.0457 4.2537 41.4286 0.4423 38.0930 1.3640 76.8155 0.6016 17.3635 3.9528 36.4099 10.0781 59.4780 35.3259 44.7273 7.5625 363.4114 10.3159 0.0941 1.8522 3.4427 168.6908 37.0919 5.3494 5.9665 3.2573 364.0175 5.6919 70.5622 2.4575 5.5713 2.3899 9.9430 14.5544 30.1344 1.2988 14.4058 6.0429 1.5022 13.8457 89.9353 36.8583 36.9650 305.8281 16.5666 91.4775 11.4345 28.2536 94.1476 0.4271 8.3271 7.5895 23.2770 21.3374 25.6129 10.5805 0.0744 13.5888 802.2227 80.8660 60.0372 54.7263 56.8993 4.3140 17.8046 44.7957 6.8567 11.2966 27.7200 43.9215 36.4679 29.2430 0.9267 19.1602 26.5797 13.3039 3.7386 4.8326 8.1890 39.4700 26.0331 5.3333
temp: 298.150 k
press: 1.00000 atm
elementType: 9 6 6 6 8 6 8 6 6 6 6 6 6 6 1 1 1 1 1 1 1 1 1 1 1 7 6 6 6 6 7 6 6 1 1 1 1 1 1 1 1 1 1 1 1
symmnumber: 1
zpe: 1009873.7 jmol-1
zpe.correction: 0.384641 hartree
zpe.thermalcorrener: 0.404552 hartree
zpe.thermalcorrenthalpy: 0.405497 hartree
zpe.thermalcorrgfe: 0.334153 hartree
zpe.sumelectzpe: -1021.204137 hartree
zpe.sumelectthermal: -1021.184226 hartree
zpe.sumelectthermalent: -1021.183281 hartree
zpe.sumelectthermalfe: -1021.254625 hartree
dipole: 0.5623 11.7553 8.6266
dipole: 14.5918
quadrupole: -134.2471 -142.0810 -87.2202
quadrupole: -24.1915 -15.9412 11.9041
quadrupole: -13.0644 -20.8983 33.9626 -24.1915 -15.9412 11.9041
hfenergy: -1021.588778 hartree
pointgroup: C01 [X(C17H23F1N2O2)]
dipole: 0.2212152 4.6248836 3.3939463 debye
polarizability: 314.604241|-12.2310593|307.5033695|18.6414264|-38.8571134|318.3820373 unknown
InChI: InChI=1/C17H23N2O2.F/c1-21-17(20)16(13-15-5-3-2-4-6-15)14-19-10-7-18(8-11-19)9-12-19;/h2-6,13H,7-12,14H2,1H3;
charge 0 multiplicity 1
45 atoms
F  -3.30515033 -1.55850024 0.4593566
C  -1.61221529 -1.07414218 0.50925673
C  -1.1756785 -0.86573547 1.83666229
C  -0.64858326 -2.01456399 2.53139807
O  -0.14308833 -1.71010041 3.77494565
C  0.43057794 -2.79934635 4.51012913
O  -0.59150198 -3.1750844 2.10725566
C  -1.18307984 0.47339072 2.47959462
C  -1.56882835 0.05854647 -0.47926715
C  -0.29693175 0.52693708 -0.8537096
C  -0.15838682 1.57429235 -1.7661684
C  -1.29226989 2.17831905 -2.31966987
C  -2.55918848 1.71728086 -1.95512864
C  -2.69722924 0.66247257 -1.04612057
H  -1.28571672 -2.02301542 0.09327713
H  1.28400606 -3.22824529 3.9771167
H  -0.30983468 -3.5828091 4.69503168
H  0.76204197 -2.37118995 5.45768368
H  -1.08450183 1.27877792 1.74961009
H  -0.39271359 0.57071933 3.22285825
H  0.58801018 0.06792988 -0.42183385
H  0.8343878 1.91865366 -2.04212167
H  -1.18767254 2.9954973 -3.0275596
H  -3.44811072 2.1766888 -2.37871176
H  -3.68080534 0.30655837 -0.76996787
N  -2.4726062 0.86134876 3.26058825
C  -2.21509889 2.15327181 3.99693446
C  -3.54041445 2.63315823 4.64341542
C  -2.85568562 -0.19354079 4.26795764
C  -4.03729932 0.34166743 5.11883666
N  -4.57396785 1.59053694 4.556444
C  -4.90343647 1.36461276 3.14045914
C  -3.62703348 1.07108133 2.31166903
H  -1.82407385 2.86566591 3.26902652
H  -1.44434819 1.93936269 4.73873847
H  -3.91150623 3.52665652 4.13540716
H  -3.37069626 2.87981863 5.69429052
H  -1.96912726 -0.40284045 4.863874
H  -3.12069877 -1.08475769 3.7001259
H  -3.71011075 0.53998363 6.14253664
H  -4.83597207 -0.40330413 5.15132809
H  -5.40532026 2.25135562 2.74563267
H  -5.59824349 0.52285185 3.08336782
H  -3.34732644 1.90716796 1.66913724
H  -3.7153366 0.16760043 1.70990506
