program: Gaussian 09
title: fluoride addition TS
version: ES64L-G09RevD.01
method: RB3LYP
basis: 6-31+G(d,p)
operation: Freq
keyword: #P
keyword: Geom=AllCheck
keyword: Guess=TCheck
keyword: SCRF=Check
keyword: GenChk
keyword: RB3LYP/6-31+G(d,p)
keyword: Freq
converged: YES YES YES YES
title: Mulliken charges:
elementType: H C C F F F C C C C C N C C H H H H C N C C C H H H H H H H H H H H H
charge: 0.150927 -0.543459 0.710696 -0.310066 -0.623906 -0.320810 0.655719 -0.289620 -0.240909 0.245855 0.145620 -0.693928 -0.241897 -0.235344 0.150378 0.168756 0.166634 0.153579 -0.251389 -0.366230 -0.346049 -0.306793 -0.265668 0.219234 0.204339 0.204266 0.208106 0.206467 0.203928 0.205804 0.204233 0.206748 0.208534 0.208245 0.207999
chargesum: 0.00000
title: Mulliken charges with hydrogens summed into heavy atoms:
elementType: C C F F F C C C C C N C C C N C C C
charge: -0.392533 0.710696 -0.310066 -0.623906 -0.320810 0.655719 -0.139242 -0.072153 0.245855 0.145620 -0.693928 -0.075264 -0.081766 0.376449 -0.366230 0.272452 0.309993 0.359110
polarizability: 3.23322466e+02 7.09611327e+01 2.87618210e+02 -7.93770806e+01 -7.50651721e+01 2.48611535e+02
1716.lowfreq: -373.0851 -19.1344 -14.0514 -10.0102 -0.1268 0.0007 0.0009 18.5368 28.5775
frequency: -373.0850 15.8969 28.4964 32.6302 44.1196 60.2056 64.2073 70.3546 79.2481 105.8745 119.1016 174.2341 212.8945 237.9618 291.9289 295.1287 299.6647 315.9368 331.8362 343.8695 368.7295 369.9625 373.9084 414.0800 464.7350 468.2299 471.4486 491.9832 507.3931 557.6190 567.1661 575.2929 614.1524 659.6924 694.6520 727.7632 755.8356 760.4646 831.5115 844.2120 846.9156 914.5875 957.8125 960.2541 966.4742 971.8168 983.9808 1022.1102 1091.0529 1095.1407 1097.0721 1110.9605 1150.2062 1191.3750 1195.7358 1197.4929 1247.5383 1256.6299 1314.2907 1316.7632 1317.3221 1332.6348 1344.0611 1349.2232 1449.9918 1453.2753 1457.3029 1461.1723 1471.5061 1475.2931 1478.2529 1481.2437 1481.9422 1498.7617 1508.1632 1511.7366 1512.7217 1515.1763 1544.5765 1567.9161 1648.9666 2285.6526 3075.4576 3088.5372 3091.5931 3098.3811 3177.9350 3184.2106 3188.5003 3189.6118 3190.6857 3191.7684 3192.8490 3199.1423 3204.4064 3206.4836 3210.8101 3211.3304 3235.6828
redmass: 15.2458 2.9347 6.8626 4.5371 5.5874 4.3845 4.2653 3.4365 4.2694 10.6786 9.7325 8.7542 1.0169 7.3053 9.5663 1.0487 7.2265 1.0370 1.0255 6.7872 9.7298 2.4302 2.3842 3.0425 2.3694 2.3952 2.3650 4.1018 9.0785 4.1476 7.7567 4.4644 7.7949 7.5760 1.7081 2.8022 6.3888 3.9330 1.3243 2.2608 3.2739 5.4425 2.6393 2.6258 2.6128 1.2830 1.3404 2.9180 1.1948 1.1939 1.1932 3.9735 1.5012 1.3683 1.3041 1.3032 2.5031 1.8855 2.0616 2.0714 2.0537 1.8359 2.9414 2.5855 1.1434 1.1439 1.1407 3.6729 1.0428 1.0409 1.0356 1.0403 1.0353 1.1764 1.0675 1.0651 1.0735 3.2591 3.1084 5.2558 5.8724 12.6739 1.0311 1.0300 1.0304 1.0322 1.1100 1.1084 1.1088 1.1086 1.0890 1.1083 1.1080 1.1089 1.0908 1.0885 1.1081 1.0951 1.0924
irintensity: 1717.2464 3.1739 11.4165 13.8398 9.0155 10.4676 1.4728 5.6858 8.7669 5.2189 6.5589 12.5951 0.0750 8.7873 0.9135 0.3278 12.1372 0.3296 0.0457 27.4280 3.9131 0.2354 0.1028 0.4062 0.2008 0.1729 0.0857 31.4965 27.3242 96.9587 9.7646 113.2928 61.8116 5.3388 106.3136 30.9478 3.5612 0.1059 18.0142 135.3498 17.0047 212.5116 42.1257 36.9309 37.9644 0.4604 0.2324 2.5639 0.1838 0.0768 0.0128 346.4423 80.1316 493.9136 0.3187 0.1394 13.7477 48.6169 0.2684 0.4508 0.1946 35.3933 335.3051 268.9053 1.7168 0.8658 1.2785 362.2659 0.8852 0.5910 0.8976 4.0588 2.4344 2.6135 62.1102 65.9597 72.5706 1487.5345 1275.4930 482.9327 206.4456 972.6302 23.4756 10.2324 18.2992 5.0307 9.0564 2.3596 0.5341 0.1891 14.3565 9.4833 10.7917 0.7329 5.6269 13.0500 4.7888 11.1108 4.3999
temp: 298.150 k
press: 1.00000 atm
elementType: 1 6 6 9 9 9 6 6 6 6 6 7 6 6 1 1 1 1 6 7 6 6 6 1 1 1 1 1 1 1 1 1 1 1 1
symmnumber: 1
zpe: 739381.4 jmol-1
zpe.correction: 0.281615 hartree
zpe.thermalcorrener: 0.301207 hartree
zpe.thermalcorrenthalpy: 0.302151 hartree
zpe.thermalcorrgfe: 0.230404 hartree
zpe.sumelectzpe: -914.463002 hartree
zpe.sumelectthermal: -914.443410 hartree
zpe.sumelectthermalent: -914.442466 hartree
zpe.sumelectthermalfe: -914.514213 hartree
dipole: 0.8685 11.8055 12.7593
dipole: 17.4047
quadrupole: -120.4579 -182.3611 -99.1809
quadrupole: 43.8890 111.0227 6.3455
quadrupole: 13.5421 -48.3611 34.8191 43.8890 111.0227 6.3455
hfenergy: -914.7446172 hartree
pointgroup: C01 [X(C13H17F3N2)]
dipole: 0.3416778 4.644623 5.019895 debye
polarizability: 323.3224655|70.9611327|287.6182101|-79.3770806|-75.0651721|248.6115349 unknown
InChI: InChI=1/C9H5F2N.C4H12N.F/c10-9(11)5-7-1-3-8(6-12)4-2-7;1-5(2,3)4;/h1-5H;1-4H3;
charge 0 multiplicity 1
35 atoms
H  3.61292842 -3.00982495 -0.23398167
C  4.47055065 -3.64461317 -0.42827458
C  4.41435846 -4.88130542 0.17309098
F  5.15277874 -5.92017935 -0.27209135
F  5.13778499 -4.9060766 1.82002419
F  3.20708029 -5.34442893 0.55895187
C  5.61642329 -3.05118543 -1.05408267
C  5.52462996 -1.69938904 -1.49141063
C  6.59377608 -1.04041428 -2.06851204
C  7.82689594 -1.70693968 -2.2428268
C  8.93583789 -1.03414436 -2.82368587
N  9.84752708 -0.47776517 -3.29697867
C  7.94192767 -3.04939665 -1.82438849
C  6.86600781 -3.70415911 -1.24889194
H  4.58743048 -1.16833584 -1.35233389
H  6.49146228 -0.00657701 -2.38313648
H  8.885914 -3.57031461 -1.95054592
H  6.99764716 -4.72977442 -0.92806954
C  6.40773248 -2.38841638 3.65222099
N  6.70926648 -1.23891037 2.73367688
C  7.71023622 -1.67584504 1.70370159
C  5.44390343 -0.80677671 2.05010495
C  7.26945178 -0.09327821 3.52313397
H  5.99543261 -3.20562707 3.05763531
H  5.6857687 -2.05209205 4.39684433
H  7.33514647 -2.69412129 4.13719675
H  7.29486284 -2.51848458 1.15538821
H  8.62609341 -1.96976099 2.21669027
H  7.90257944 -0.8408968 1.03069211
H  5.05226109 -1.65199138 1.48624468
H  5.67662793 0.02265846 1.38298303
H  4.73124127 -0.49319371 2.81274969
H  8.1837175 -0.42615447 4.01460816
H  6.5297561 0.21174833 4.2632789
H  7.48290005 0.72781726 2.83869164
