program: Gaussian 09
title: carbanion addition step 3
version: ES64L-G09RevD.01
method: RB3LYP
basis: 6-31+G(d,p)
operation: Freq
keyword: #P
keyword: Geom=AllCheck
keyword: Guess=TCheck
keyword: SCRF=Check
keyword: GenChk
keyword: RB3LYP/6-31+G(d,p)
keyword: Freq
converged: YES YES YES YES
title: Mulliken charges:
elementType: F C C C O C O C C C C C C C H H H H H H H H H H H H C C F F F C C C C C N C C H H H H
charge: -0.359099 0.066654 0.421048 -0.289898 -0.233965 -0.100575 -0.492716 -0.462256 0.037849 -0.126664 -0.223539 -0.094904 -0.299393 0.050412 0.147459 0.156334 0.162927 0.154562 0.173542 0.178387 0.154057 0.158552 0.156402 0.156897 0.153313 0.157953 -0.451323 1.001528 -0.368956 -0.337582 -0.337178 0.460718 -0.370279 -0.132282 0.426859 -0.114855 -0.671513 -0.245727 -0.277351 0.142138 0.157229 0.163297 0.151936
chargesum: -1.00000
title: Mulliken charges with hydrogens summed into heavy atoms:
elementType: F C C C O C O C C C C C C C C C F F F C C C C C N C C
charge: -0.359099 0.214114 0.421048 -0.289898 -0.233965 0.373248 -0.492716 -0.110326 0.037849 0.027394 -0.064986 0.061498 -0.142496 0.203726 -0.293370 1.001528 -0.368956 -0.337582 -0.337178 0.460718 -0.228141 0.024947 0.426859 -0.114855 -0.671513 -0.082430 -0.125416
polarizability: 3.87188921e+02 -7.06908687e+01 3.45148280e+02 4.52184273e+01 -4.72990022e+01 5.68677680e+02
1716.lowfreq: -193.9045 -17.5304 -13.0385 -7.1147 -0.0004 0.0005 0.0006 14.6368 15.5390
frequency: -193.9042 11.5774 15.0791 30.7131 44.6874 51.9700 63.3378 69.9897 73.1644 83.9039 94.9083 102.0269 110.8454 120.4204 145.4509 171.6572 179.9691 182.9558 212.9533 246.1063 259.7223 278.9662 296.2583 304.6409 323.9697 374.2586 389.3950 394.0043 413.2696 420.2843 468.4342 477.9302 491.3187 528.1070 539.9656 545.9305 553.0602 569.8685 572.7190 610.9977 631.1548 644.5460 669.0243 681.6151 697.7513 710.7720 722.9704 751.4995 758.7070 770.5857 799.3999 821.9196 824.4883 832.4559 843.3540 859.4137 862.0359 874.7605 889.0030 914.3607 938.5495 965.2881 976.5661 978.6704 990.9647 1001.3674 1007.5533 1015.9085 1017.8965 1032.6704 1043.7886 1050.1791 1101.6912 1147.2909 1159.0290 1167.9915 1172.5389 1185.1556 1193.0740 1206.8688 1218.1859 1223.1545 1252.6569 1256.4457 1290.2183 1324.5346 1334.3116 1351.5785 1354.6769 1359.3398 1393.1521 1413.8022 1443.7975 1467.3287 1481.5136 1483.9034 1484.1786 1485.2369 1530.3612 1539.6318 1553.0267 1566.4512 1630.4764 1636.2351 1652.5012 1681.1728 2270.1644 3056.6966 3127.1500 3133.9026 3167.7491 3181.0653 3188.1654 3193.0144 3196.1280 3196.5743 3197.5839 3206.8381 3213.4021 3215.6582 3217.4236 3218.3325 3289.6098
redmass: 11.2566 7.3677 6.0237 6.6482 8.1366 6.1290 5.2142 6.0870 5.7700 10.3667 7.4125 4.7766 9.3024 5.6080 3.2482 8.3336 6.0431 1.2411 5.1759 6.5669 5.7243 5.9909 9.0707 7.3310 4.6139 3.4877 8.4830 5.8198 2.9124 3.1213 10.0375 4.3155 4.3049 8.4101 8.4664 4.9242 4.5580 5.7835 7.2349 5.7022 6.3442 8.7126 9.6288 1.8422 1.9923 1.6870 3.7388 3.2892 3.5389 2.4389 6.9734 1.3408 3.2819 2.0237 2.9863 3.0482 1.4040 5.0323 2.2803 5.8147 1.5087 1.2811 1.3465 2.5485 1.3681 1.3909 1.2826 5.9656 2.9009 2.5975 5.9637 2.1248 1.5652 1.4476 2.9830 1.3654 1.0863 1.5504 1.1283 1.8145 2.0134 1.9374 2.4183 1.7956 2.9353 1.4295 1.7772 1.5857 2.5418 3.0747 2.2990 1.5490 2.5476 1.0904 2.1781 1.1254 3.1331 1.1326 2.3177 2.5289 5.0915 2.8126 5.7175 5.6035 5.7652 10.4230 12.6646 1.0327 1.0857 1.1034 1.1065 1.0870 1.0883 1.0589 1.0890 1.0927 1.0892 1.0962 1.0896 1.0934 1.0942 1.0926 1.1168
irintensity: 884.7525 0.4597 0.3403 1.3040 1.2222 2.9019 3.5861 1.5326 7.4510 1.9174 3.7064 5.8454 12.2574 13.9778 10.7639 7.0153 4.6574 4.4430 23.0143 10.6630 6.4061 41.7781 5.8248 2.5398 15.6152 8.8004 138.9971 36.3639 0.1415 1.6208 7.3411 29.5159 3.7176 84.2983 44.3938 49.9135 41.7910 50.0357 6.8460 28.5033 5.0958 5.1646 4.3707 281.5282 171.2801 99.0213 23.3971 25.9311 86.7142 37.7722 443.3126 8.7831 90.6990 291.2739 16.4730 94.2728 25.6762 312.3059 26.2205 592.2959 9.3229 1.7134 0.7934 69.5461 0.1501 101.4846 1.3961 1.7327 13.1379 12.4465 251.7535 9.6069 11.2483 43.2736 318.0517 49.1763 0.4896 1059.6831 1.3547 420.1000 416.3793 34.7947 60.2819 114.4615 140.1141 10.3174 7.3841 97.8860 90.2727 0.9468 212.6370 124.9142 591.5647 19.0499 16.1054 36.3000 54.5509 19.3423 7.6495 481.4963 24.6686 231.1064 10.5695 803.0842 7.6314 1004.1263 1318.1466 67.8570 24.8235 40.5210 20.2502 5.2166 1.8010 18.2834 8.4076 32.7409 8.3051 32.0857 0.2082 18.7898 1.2019 12.5024 0.6584
temp: 298.150 k
press: 1.00000 atm
elementType: 9 6 6 6 8 6 8 6 6 6 6 6 6 6 1 1 1 1 1 1 1 1 1 1 1 1 6 6 9 9 9 6 6 6 6 6 7 6 6 1 1 1 1
symmnumber: 1
zpe: 827905.6 jmol-1
zpe.correction: 0.315333 hartree
zpe.thermalcorrener: 0.340334 hartree
zpe.thermalcorrenthalpy: 0.341279 hartree
zpe.thermalcorrgfe: 0.256803 hartree
zpe.sumelectzpe: -1376.306612 hartree
zpe.sumelectthermal: -1376.281610 hartree
zpe.sumelectthermalent: -1376.280666 hartree
zpe.sumelectthermalfe: -1376.365142 hartree
dipole: 4.6705 0.6353 -23.6299
dipole: 24.0954
quadrupole: -180.8251 -186.0490 -311.1611
quadrupole: 19.1883 10.8667 8.6117
quadrupole: 45.1866 39.9628 -85.1494 19.1883 10.8667 8.6117
hfenergy: -1376.6219448 hartree
pointgroup: C01 [X(C20H16F4N1O2)]
dipole: -0.0980859 1.4567218 -3.9655439 debye
polarizability: 387.1889214|-70.6908687|345.1482797|45.2184273|-47.2990022|568.6776795 unknown
InChI: InChI=1/C11H11FO2.C9H5F3N/c1-8(11(13)14-2)10(12)9-6-4-3-5-7-9;10-9(11,12)5-7-1-3-8(6-13)4-2-7/h3-7,10H,1H2,2H3;1-5H
charge -1 multiplicity 1
43 atoms
F  -1.41936181 -1.72027311 1.50975112
C  -0.41052833 -0.84888066 0.89700544
C  0.03242434 0.17419002 1.89159115
C  1.0362832 -0.27721906 2.85176106
O  1.41260133 0.68559717 3.7359997
C  2.3626787 0.29033431 4.73579891
O  1.55239413 -1.39744437 2.86284122
C  -0.5135506 1.43664899 1.9448946
C  -1.00172585 -0.30489216 -0.37703987
C  -0.16641665 -0.10852412 -1.48439731
C  -0.66994924 0.44517309 -2.66398292
C  -2.02009339 0.80005953 -2.75091731
C  -2.86016583 0.59735021 -1.65176519
C  -2.35365058 0.05047913 -0.46975427
H  0.40971505 -1.53213842 0.67438389
H  3.33737205 0.07982838 4.28491583
H  2.01584837 -0.59209736 5.27702168
H  2.44455982 1.13966914 5.41504438
H  -1.10066849 1.80872322 1.11506065
H  -0.08597003 2.17895345 2.60402679
H  0.88235316 -0.38676406 -1.41924669
H  -0.01118749 0.59246657 -3.51499506
H  -2.41469518 1.22661035 -3.66856678
H  -3.91042761 0.86841689 -1.7114457
H  -3.00912815 -0.1006365 0.38102769
H  -2.95287539 0.7252573 2.61452131
C  -2.47619348 1.46091575 3.25119421
C  -2.99355596 2.80494703 3.03982334
F  -4.09153137 3.17833353 3.83629853
F  -2.09515471 3.82610677 3.26901894
F  -3.44149318 2.98591761 1.75787641
C  -1.93871085 1.0149842 4.49053028
C  -1.68070224 -0.37913106 4.65599687
C  -1.0449941 -0.87467564 5.77757004
C  -0.64414599 -0.0028173 6.81470426
C  0.03053985 -0.50264969 7.95711694
N  0.59423362 -0.9136097 8.89609832
C  -0.91440153 1.38020591 6.68674678
C  -1.54298863 1.87340942 5.55998074
H  -1.97957577 -1.06115009 3.86791662
H  -0.84549585 -1.93844636 5.86442274
H  -0.62054961 2.05745557 7.48299941
H  -1.72410872 2.94033712 5.49457226
