program: Gaussian 09
title: adduct 1, positively charged
version: ES64L-G09RevD.01
method: RB3LYP
basis: 6-31+G(d,p)
operation: Freq
keyword: #P
keyword: Geom=AllCheck
keyword: Guess=TCheck
keyword: SCRF=Check
keyword: GenChk
keyword: RB3LYP/6-31+G(d,p)
keyword: Freq
converged: YES YES NO YES
title: Mulliken charges:
elementType: O C C C N C C N C C C C C C C C C C C O C H H H H H H H H H H H H H H H H H H H H H H H
charge: -0.489652 0.541490 -0.419646 -0.277745 -0.470621 -0.029112 -0.292619 -0.223565 -0.371643 0.056965 -0.404270 -0.162162 0.139760 0.438098 -0.209248 -0.125634 -0.151525 -0.060900 -0.349064 -0.263834 -0.153286 0.216486 0.187480 0.206096 0.212953 0.179746 0.183132 0.181959 0.179161 0.209668 0.208815 0.182534 0.179990 0.219277 0.218775 0.190273 0.155018 0.161049 0.161633 0.161609 0.154732 0.176311 0.180249 0.171272
chargesum: 1.00000
title: Mulliken charges with hydrogens summed into heavy atoms:
elementType: O C C C N C C N C C C C C C C C C C C O C
charge: -0.489652 0.541490 -0.419646 0.126221 -0.470621 0.389937 0.070259 -0.223565 -0.010523 0.475449 -0.041746 0.275890 0.330032 0.438098 -0.054230 0.035414 0.010108 0.100708 -0.194333 -0.263834 0.374546
polarizability: 2.58934762e+02 -9.39570181e+00 2.53531467e+02 5.38021148e+00 5.32900170e+01 3.34353037e+02
1716.lowfreq: -18.8344 -10.5540 -0.0109 0.0008 0.0010 11.5058 31.3415 37.0905 48.9971
frequency: 30.7796 36.8442 48.5481 56.0175 68.2981 99.4448 106.5543 126.9602 140.2259 168.2122 178.7975 201.0404 260.1612 271.7107 302.8079 331.1493 348.5577 358.0358 389.8753 418.7356 429.3816 433.3424 437.5869 495.7432 547.9680 570.7092 575.5895 583.1417 616.9113 634.3547 697.3989 709.9615 720.0090 763.0588 791.4334 807.0984 831.8828 838.3146 849.9629 854.2917 858.9005 868.7190 900.4270 912.8839 945.6643 968.9320 978.1868 989.0183 998.2858 999.3912 1006.8392 1012.9684 1017.3218 1024.2207 1037.3490 1041.6550 1054.0902 1078.0574 1081.1140 1087.0730 1108.6978 1138.6192 1169.0762 1176.2265 1203.0515 1210.1914 1212.3665 1217.4724 1228.0852 1232.4099 1270.6715 1284.7069 1307.1207 1335.4554 1338.9146 1347.6246 1350.9307 1359.0296 1363.5067 1364.4664 1372.6383 1375.6058 1388.3638 1390.5171 1411.3309 1419.7640 1463.2295 1473.4012 1475.0879 1478.0890 1480.3355 1484.9606 1488.4755 1490.8519 1495.8145 1496.6873 1501.0076 1511.4491 1530.1383 1620.6334 1647.5528 1673.0279 1755.9456 3071.6949 3088.1512 3089.3935 3091.4241 3108.4607 3119.0590 3127.2873 3138.2825 3139.8784 3142.1920 3144.2167 3156.9561 3173.7820 3175.2075 3185.3366 3186.1269 3189.4055 3193.9347 3194.5976 3201.5516 3208.4949 3214.6966 3218.9883
redmass: 4.0948 4.7165 4.1303 3.4974 2.9597 2.1897 3.1088 1.7663 2.8993 2.7593 3.7939 3.9215 3.3258 6.2013 2.3022 2.1951 3.8236 2.9412 2.1950 2.9208 2.6892 3.0101 2.7757 3.2174 4.0369 4.1088 3.8577 5.5382 6.5650 6.2253 4.5961 2.9224 2.1438 2.1632 4.7665 3.9870 1.2919 3.0885 1.9895 2.2016 1.6844 1.2626 3.2429 2.9513 1.3880 3.0273 1.6686 2.9898 4.1273 1.3923 4.1832 1.9150 2.3353 3.2351 2.4946 1.5548 2.0840 2.8863 2.8500 4.4010 1.6524 2.7657 1.2797 1.0825 1.2024 1.7838 1.9971 1.6414 1.0665 2.5094 1.5894 1.1594 1.8586 1.2176 1.8932 1.6860 1.2828 1.4582 1.4921 1.3212 1.3585 1.3124 1.4589 1.3963 1.4517 1.3460 1.3828 1.0576 1.1790 1.7199 1.0647 1.2111 1.0830 1.0867 1.0862 1.0968 1.0860 1.0944 2.1958 5.4102 5.5770 7.4518 11.1844 1.0296 1.0589 1.0593 1.0607 1.0599 1.0585 1.0584 1.1089 1.1095 1.1097 1.0653 1.1085 1.1109 1.0879 1.1109 1.1075 1.0869 1.0894 1.1105 1.0923 1.0963 1.0997 1.1000
irintensity: 0.5455 0.3144 0.7946 0.7690 0.2189 0.5399 0.7160 2.4511 2.3537 6.8465 6.0705 4.0728 10.0942 1.5256 3.6095 2.7879 15.0807 7.3078 4.3652 3.1066 5.7240 7.2140 17.2047 6.3302 40.1387 3.2801 0.6838 11.5862 10.1743 2.4751 11.7504 12.1100 57.5153 48.7436 55.0693 17.5610 3.4135 24.1273 17.3711 23.6242 18.5063 0.8391 38.7427 10.8182 5.7585 7.7730 10.2491 0.6959 31.6143 2.6131 59.7612 2.1892 5.1308 6.3583 8.8546 2.7836 1.7072 32.2953 37.3191 56.4392 15.3284 108.8605 2.6401 0.3676 42.8282 18.4919 4.4711 56.5305 0.9292 354.4356 271.2389 52.5333 142.6461 4.5155 12.2136 35.3616 8.4063 0.3650 1.1508 3.5066 8.5550 0.3496 10.3203 7.0600 25.8496 8.4035 8.2519 16.9721 9.7598 6.3229 23.7889 25.4242 4.0459 0.6826 24.2362 19.8023 27.1759 21.7702 16.2236 4.9761 2.1416 269.4146 349.1593 37.2220 39.9675 43.0403 39.0358 11.8655 12.7902 7.2415 12.4748 12.2291 13.9387 4.4239 17.1051 12.6536 0.4358 7.1077 11.9292 1.7397 0.1388 5.7804 11.1683 19.8083 12.2012 4.7197
temp: 298.150 k
press: 1.00000 atm
elementType: 8 6 6 6 7 6 6 7 6 6 6 6 6 6 6 6 6 6 6 8 6 1 1 1 1 1 1 1 1 1 1 1 1 1 1 1 1 1 1 1 1 1 1 1
symmnumber: 1
zpe: 1012008.7 jmol-1
zpe.correction: 0.385454 hartree
zpe.thermalcorrener: 0.404192 hartree
zpe.thermalcorrenthalpy: 0.405136 hartree
zpe.thermalcorrgfe: 0.337281 hartree
zpe.sumelectzpe: -921.213268 hartree
zpe.sumelectthermal: -921.194530 hartree
zpe.sumelectthermalent: -921.193586 hartree
zpe.sumelectthermalfe: -921.261441 hartree
dipole: 17.1970 -4.3383 -1.6333
dipole: 17.8108
quadrupole: -62.0151 -110.1079 -93.5733
quadrupole: -24.0331 -6.2485 14.0423
quadrupole: 26.5504 -21.5425 -5.0079 -24.0331 -6.2485 14.0423
hfenergy: -921.5987221 hartree
pointgroup: C01[X(C17H23N2O2)]
dipole: 2.4969216 0.392216 -0.9162695 debye
polarizability: 258.9347619|-9.3957018|253.5314666|5.3802115|53.290017|334.353037 unknown
InChI: InChI=1/C17H23N2O2/c1-21-17(20)16(13-15-5-3-2-4-6-15)14-19-10-7-18(8-11-19)9-12-19/h2-6,13H,7-12,14H2,1H3
charge 1 multiplicity 1
44 atoms
O  -0.50330598 -3.09964106 -1.10844645
C  0.71161574 -3.05573589 -1.00621357
C  1.45275601 -2.37858406 0.10287015
C  2.93549856 -2.15305669 -0.03523806
N  3.31334129 -0.84187852 -0.724828
C  2.80187809 -0.77247163 -2.14785721
C  3.20827432 0.59862482 -2.75463189
N  4.08325069 1.34438835 -1.84359012
C  5.25174317 0.51979374 -1.51768197
C  4.82918029 -0.75851117 -0.74844018
C  3.34962638 1.64773974 -0.60944531
C  2.78268134 0.3557679 0.03871184
C  0.71435563 -2.02147934 1.17824621
C  1.15087629 -1.40022491 2.43573159
C  2.26478767 -1.84712009 3.16869081
C  2.63595485 -1.20407681 4.3496472
C  1.90802741 -0.10315234 4.8121003
C  0.78364273 0.33248463 4.10433519
C  0.39655455 -0.32316469 2.9358325
O  1.54368732 -3.64253079 -1.88777578
C  0.92119177 -4.3349317 -2.99385808
H  3.39985697 -2.94205677 -0.62431424
H  3.42791062 -2.10394333 0.93087977
H  1.72027025 -0.88943133 -2.10852695
H  3.24016602 -1.61818724 -2.67686216
H  2.31904894 1.20196987 -2.9503182
H  3.73199753 0.44214529 -3.70019665
H  5.94173243 1.10665052 -0.90760576
H  5.75774862 0.25365096 -2.44848641
H  5.14872025 -0.74341786 0.29440939
H  5.19021972 -1.67149855 -1.22220518
H  2.53145271 2.33219355 -0.84335971
H  4.03033441 2.14932353 0.08190069
H  1.69654826 0.30768189 -0.01906443
H  3.09367204 0.23385414 1.07587266
H  -0.35767433 -2.18699578 1.08923527
H  2.81472303 -2.72310964 2.84136421
H  3.48874611 -1.56859377 4.91429376
H  2.20318257 0.39929986 5.7281823
H  0.20166766 1.17365462 4.46831625
H  -0.48474462 0.00696558 2.39321399
H  0.33457339 -3.63681233 -3.59518569
H  0.27838444 -5.13640139 -2.62408042
H  1.74474586 -4.74495132 -3.57720269
